program: Gaussian 09
title: 000208189
version: EM64L-G09RevD.01
frameworkgroup: C1[X(C7H10ClNS)]
method: RPBEPBE
basis: SDD
operation: Freq
keyword: #p
keyword: freq=noraman
keyword: PBEPBE/SDD
title: #p freq=noraman PBEPBE/SDD
converged: YES YES NO NO
title: Mulliken charges:
elementType: Cl S N C C C C C C C H H H H H H H H H H
charge: 0.029437 0.299129 0.083016 -0.463408 -0.340203 -0.230563 0.262098 -0.684637 -0.750194 -0.428248 0.211110 0.221726 0.208520 0.217569 0.211894 0.212367 0.226837 0.248382 0.247927 0.217242
chargesum: 0.00000
title: Mulliken charges with hydrogens summed into heavy atoms:
elementType: Cl S N C C C C C C C
charge: 0.029437 0.299129 0.083016 -0.030573 0.085887 -0.230563 0.262098 -0.033540 -0.036643 -0.428248
polarizability: 1.47592123e+02 -4.26178684e+00 1.10030821e+02 6.42920140e+00 3.44293805e+00 6.27433126e+01
1716.lowfreq: -6.5892 -3.3830 -0.0030 -0.0022 -0.0016 7.9950 27.6803 65.9998 74.6456
frequency: 27.5141 65.9899 74.6435 106.9713 169.2923 189.0504 212.9287 222.4717 273.3764 293.4237 352.4553 362.8991 453.9855 511.6937 536.9255 609.7294 628.4373 664.4216 735.4945 830.2587 885.5133 887.2236 936.2087 992.7928 1042.3009 1050.3051 1094.0567 1121.7703 1161.8302 1231.3201 1273.4300 1288.3356 1294.6063 1338.3657 1391.9644 1401.0171 1456.7725 1459.7104 1469.2292 1470.6713 1473.2800 1477.4706 1484.8205 1567.1401 2974.1803 2975.9994 2988.4620 2993.1324 3025.2116 3047.6918 3073.9742 3074.4811 3078.9861 3108.4703
redmass: 2.6714 3.0266 2.8539 1.0427 5.6391 4.0551 5.2211 1.1381 2.9071 2.9364 5.4007 6.6763 5.6759 7.6902 7.7264 5.8550 6.3490 4.5292 1.1634 2.0217 2.0421 2.1639 3.7840 1.7850 1.4747 2.9420 2.0826 1.8083 3.3869 1.3147 1.5339 1.1058 3.6780 1.4789 1.2122 1.2690 1.0916 1.0517 3.3437 1.4022 1.0729 1.0435 1.0773 5.9371 1.0536 1.0438 1.0613 1.0372 1.0966 1.1014 1.0994 1.1007 1.0990 1.0984
irintensity: 0.0534 0.0063 0.0796 0.1907 0.7883 3.7556 0.7960 0.0073 0.1104 0.6532 2.0122 5.5472 5.0515 5.1301 3.8511 12.8362 3.0068 0.7713 5.0158 14.6590 54.3852 12.3744 72.7002 19.1159 4.6670 0.1196 8.5624 14.8284 5.6001 1.7431 0.4313 0.0664 2.2599 1.2560 11.1151 25.8864 1.4688 12.7797 103.8959 35.3302 11.0867 17.1842 18.3128 11.1244 4.9382 45.2343 36.8280 23.8326 3.1688 6.2398 20.1380 65.8678 43.0105 19.7606
temp: 298.150 k
press: 1.00000 atm
elementType: 17 16 7 6 6 6 6 6 6 6 1 1 1 1 1 1 1 1 1 1
symmnumber: 1
zpe: 406208.1 jmol-1
zpe.correction: 0.154716 hartree
zpe.thermalcorrener: 0.166301 hartree
zpe.thermalcorrenthalpy: 0.167245 hartree
zpe.thermalcorrgfe: 0.115539 hartree
zpe.sumelectzpe: -1184.833380 hartree
zpe.sumelectthermal: -1184.821795 hartree
zpe.sumelectthermalent: -1184.820851 hartree
zpe.sumelectthermalfe: -1184.872558 hartree
dipole: -3.7458 0.1814 -0.3252
dipole: 3.7643
quadrupole: -75.4531 -72.5197 -75.2318
quadrupole: -2.9196 -0.1923 -0.1909
quadrupole: -1.0515 1.8818 -0.8302 -2.9196 -0.1923 -0.1909
hfenergy: -1184.9880962 hartree
pointgroup: C01 [X(C7H10Cl1N1S1)]
dipole: -1.4639884 -0.1564833 0.1598649 debye
dipolederiv: -0.8158188 -0.2455585 0.1232141 -0.2774024 -0.1853743 0.0437346 0.14318 0.0458145 -0.0337737 -0.3874986 0.0563206 0.0991696 0.1214008 -0.380951 -0.0065323 0.1194716 0.0044149 0.1297497 -0.5030694 -0.1457851 0.0489147 -0.157495 -0.9325294 0.0351477 0.0822331 0.034326 -0.125967 -0.0691445 0.0079769 -0.0199629 -0.0079226 0.0581539 0.0505363 -0.0770949 0.0523834 0.1255988 0.0663447 0.0022422 0.0239848 -0.0267056 0.1370466 0.0179929 0.1453766 0.0126439 0.0981244 0.2582767 0.150957 -0.0587888 0.1223478 0.2155239 -0.0025744 -0.1447793 -0.0186796 -0.2058592 0.0435429 0.1206175 -0.022533 0.1308926 0.396075 -0.0407043 -0.004353 -0.0247283 -0.0139507 -0.0867373 0.0224821 -0.0036695 0.0490342 0.0924672 0.0166348 -0.0735037 0.0230206 0.0627671 0.0519074 0.0458727 0.0055317 -0.0345378 -0.1175652 0.0106818 0.0060925 -0.0073241 0.0825775 1.3482276 0.0853713 -0.2410957 0.1417063 0.8701255 -0.0269675 -0.2646634 -0.035644 -0.0639436 -0.002826 -0.0730172 0.014683 -0.0790715 -0.0944744 0.0708552 -0.0040077 0.0360327 0.0664235 0.0036313 0.0283788 0.0354404 0.0565379 0.0192659 -0.1205801 0.0439786 -0.0718207 -0.0682626 -0.0029308 -0.0967737 0.0139278 -0.0912648 -0.1018829 0.0656853 0.0009922 0.0260477 0.056167 0.0318746 0.0441318 0.0405283 0.0281339 0.0056204 -0.1167513 0.021683 -0.0787063 -0.0955913 0.0319403 -0.04571 0.0198122 -0.1240162 -0.1329498 0.0464304 0.0515395 0.0419779 0.0838544 0.0584579 0.0025012 0.0139911 0.0330934 0.0090601 -0.1209939 0.0832259 -0.129032 -0.0871154 -0.0602682 0.0589849 -0.0920731 0.0814293 0.0587622 0.0797744 -0.1299958 0.0829385 -0.0557105 0.1037212 0.0127796 0.0529092 0.0026519 -0.0063215 -0.0572407 0.0381466 -0.1119887 -0.0408158 0.0671392 0.0406993 -0.0896833 0.0198686 -0.0046769 0.0611274 -0.0741451 0.1058284 -0.0124058 -0.1367702 -0.0724715 0.0356994 0.0113193 0.0946246 -0.0062563 0.0366233 0.0124952 0.0981333 unknown
polarizability: 146.7025|5.8879162|110.7475462|-8.0666225|-3.5407816|62.9162103 unknown
InChI: InChI=1S/C7H10ClNS/c1-3-4-6-5(2)9-7(8)10-6/h3-4H2,1-2H3
charge 0 multiplicity 1
20 atoms
Cl 3.705798 1.143774 -0.411682
S  0.650949 1.509403 0.104447
N  1.8584 -0.859346 -0.064646
C  -1.816603 0.079486 0.53506
C  -2.614185 0.683991 -0.655716
C  -0.334335 -0.020152 0.295699
C  0.489898 -1.134827 0.172741
C  -4.126462 0.757454 -0.359866
C  0.080973 -2.582498 0.264249
C  2.09377 0.422045 -0.123037
H  -2.205628 -0.933866 0.750397
H  -2.018358 0.685683 1.441385
H  -2.225358 1.697253 -0.877225
H  -2.430131 0.07347 -1.560391
H  -4.5453 -0.247433 -0.163137
H  -4.329233 1.386249 0.527554
H  -4.678592 1.190705 -1.213082
H  0.355032 -3.115967 -0.66338
H  0.611464 -3.079832 1.096031
H  -1.0030 -2.696094 0.4241
