program: Gaussian 09
title: 000210410
version: EM64L-G09RevD.01
frameworkgroup: C1[X(C5H12N2O)]
method: RPBEPBE
basis: SDD
operation: Freq
keyword: #p
keyword: freq=noraman
keyword: PBEPBE/SDD
title: #p freq=noraman PBEPBE/SDD
converged: NO YES NO NO
title: Mulliken charges:
elementType: O N N C C C C C H H H H H H H H H H H H
charge: -0.329189 -0.163735 -0.404990 -0.331611 0.332388 -0.630544 -0.665691 -0.634961 0.207112 0.206957 0.309931 0.288022 0.217336 0.217398 0.230292 0.243572 0.230373 0.242352 0.242924 0.192065
chargesum: 0.00000
title: Mulliken charges with hydrogens summed into heavy atoms:
elementType: O N N C C C C C
charge: -0.329189 -0.163735 -0.095059 0.082458 0.332388 0.092211 0.038546 0.042380
polarizability: 9.27110471e+01 5.93639276e-01 7.35977275e+01 -1.37151617e-02 -2.34705734e-02 5.17075365e+01
1716.lowfreq: -106.2034 -22.3730 -8.3334 -1.3382 -0.0013 -0.0013 -0.0011 28.4495 84.2671
frequency: -106.0640 17.7717 84.2658 118.3501 171.2236 187.4345 214.2753 281.8501 285.1588 376.2827 408.3586 486.5385 507.4282 612.7700 700.7261 801.4165 830.1309 876.7988 986.3680 1055.9558 1090.1363 1094.6831 1114.9387 1134.1428 1142.7401 1232.3746 1267.4688 1288.7302 1329.6334 1345.7301 1404.8857 1413.6083 1444.7417 1460.9584 1472.5119 1476.8742 1482.1123 1490.0276 1493.0200 1499.0682 1541.0580 1619.1834 2928.2303 2943.1168 2956.2949 2979.5092 2991.3792 2997.1588 3025.8888 3089.8678 3099.3188 3109.9554 3134.5532 3557.6550
redmass: 2.0126 1.8355 2.4877 1.9125 1.1299 3.4342 1.9770 1.1117 3.2876 4.2593 2.6820 1.1726 4.0099 4.0385 11.7312 1.1158 5.4868 2.8970 2.1141 1.4146 2.6240 1.2355 1.9152 1.3337 1.4874 2.8224 4.6686 1.0965 2.1506 1.5786 1.2083 1.1500 1.1658 1.0407 1.0541 1.0448 1.0978 1.1449 1.0458 1.0910 1.6346 5.5963 1.0383 1.0573 1.0369 1.1049 1.1013 1.0421 1.1022 1.0937 1.0931 1.0955 1.1011 1.0750
irintensity: 0.8740 1.5586 8.3008 1.9091 0.5221 1.8784 1.8719 0.0446 6.0639 18.0415 0.8397 107.3038 4.7017 0.2884 22.0851 2.0993 0.0525 1.1828 29.7866 20.8653 41.5926 0.0084 26.1249 1.2135 5.1991 148.8216 17.0323 0.1619 26.7668 205.5084 40.9050 29.7573 13.2258 10.1642 39.9530 19.4039 24.1348 28.0727 5.7608 51.0496 189.3014 252.2388 65.0376 96.9488 86.7420 42.3634 54.2727 50.0100 53.8608 18.8069 32.8797 1.0058 26.2888 5.7347
temp: 298.150 k
press: 1.00000 atm
elementType: 8 7 7 6 6 6 6 6 1 1 1 1 1 1 1 1 1 1 1 1
symmnumber: 1
zpe: 452515.4 jmol-1
zpe.correction: 0.172354 hartree
zpe.thermalcorrener: 0.182034 hartree
zpe.thermalcorrenthalpy: 0.182979 hartree
zpe.thermalcorrgfe: 0.136585 hartree
zpe.sumelectzpe: -381.793255 hartree
zpe.sumelectthermal: -381.783575 hartree
zpe.sumelectthermalent: -381.782630 hartree
zpe.sumelectthermalfe: -381.829024 hartree
dipole: -1.4289 4.2037 0.0026
dipole: 4.4399
quadrupole: -41.8905 -50.3838 -50.8339
quadrupole: 1.3667 -0.0099 -0.0085
quadrupole: 5.8122 -2.6810 -3.1312 1.3667 -0.0099 -0.0085
hfenergy: -381.965609 hartree
pointgroup: C01 [X(C5H12N2O1)]
dipole: -0.5336993 -1.6632509 -0.0041584 debye
dipolederiv: -0.8429287 -0.1781957 -0.0011432 -0.1803656 -1.1158019 -0.0027821 -0.0005115 0.0002538 -0.37917 -1.375698 -0.1342155 -0.0011762 -0.0670639 -0.6265258 0.0001799 -0.003957 -0.0019072 -0.3608471 -1.1003964 0.3439518 -0.001338 0.5502801 -0.6379401 0.0000464 0.0005577 -0.0011041 -0.5124407 0.8290597 -0.1455541 0.0002104 -0.0239364 0.1534443 0.0000964 0.0003218 -0.0000298 0.3782262 2.1270415 0.0851864 0.0040972 -0.1359983 1.4578617 0.0025938 0.0035362 0.0010788 0.2752721 0.3583701 -0.2408558 -0.0010629 -0.4200645 0.1658711 -0.0011816 -0.0010285 -0.0010569 0.284406 0.0614309 0.0662843 -0.0011414 0.2055287 0.4505338 -0.0008548 -0.0010599 -0.0008844 0.295406 0.0224444 -0.0711712 0.0000621 -0.0747235 -0.0495766 0.0002104 0.0001796 0.0002571 0.0428163 -0.103447 0.0531542 -0.0364487 0.0548087 -0.0315067 0.1160389 -0.1033288 0.149263 -0.0983739 -0.1025912 0.0527509 0.0357972 0.0550132 -0.0328394 -0.1164474 0.1023691 -0.1496622 -0.0971297 0.116089 -0.0341998 0.0010006 -0.0399866 0.0675201 0.0000114 0.0013155 0.0002903 0.3190258 0.1900242 -0.1203186 -0.0005056 -0.0045952 -0.0042454 -0.0006457 -0.0000586 -0.0007175 0.1285959 -0.1050231 0.0717024 0.1121674 0.0346763 0.0844734 0.0462983 0.1687576 -0.0069735 -0.103215 -0.1033124 0.0722468 -0.1113417 0.0358481 0.0846745 -0.0447183 -0.168139 0.0086624 -0.1045966 0.081165 0.072126 0.0877003 -0.0285543 -0.0840413 -0.0809901 0.0405023 -0.1254447 -0.0930135 -0.1428784 -0.0483728 -0.002506 0.0242732 0.0918449 0.0006934 -0.0024728 -0.0001334 0.1216644 0.0825768 0.0691005 -0.0839684 -0.0312582 -0.0861349 0.0815085 -0.0368593 0.128159 -0.0954213 0.128442 0.0363152 -0.0525888 -0.0126667 0.0191948 0.0817114 -0.0473234 0.08165 -0.0539938 0.1297089 0.0363211 0.0515772 -0.0129087 0.018653 -0.0817653 0.0465388 -0.0818535 -0.0526933 -0.2500772 0.0137439 0.0006085 0.0716938 0.0745406 -0.0000034 0.0006602 0.0001528 0.1054822 unknown
polarizability: 92.7257855|-0.2654152|73.5829968|0.017726|0.01737|51.7075288 unknown
InChI: InChI=1S/C5H12N2O/c1-4-6-5(8)7(2)3/h6H,4H2,1-3H3
charge 0 multiplicity 1
20 atoms
O  0.19643 1.502639 0.008578
N  -1.534429 -0.075014 0.003183
N  0.709485 -0.803056 0.00679
C  2.192115 -0.788551 0.004622
C  -0.16828 0.282995 0.008579
C  -2.535252 1.001303 0.004937
C  -2.005776 -1.464399 -0.003149
C  2.879635 0.588573 -0.000663
H  2.540043 -1.351534 0.896614
H  2.537211 -1.356693 -0.88519
H  0.303499 -1.738591 0.007908
H  -1.994088 1.959957 0.010014
H  -3.181397 0.94801 0.903467
H  -3.176884 0.955149 -0.89721
H  -1.669714 -2.021423 -0.90335
H  -3.107641 -1.469609 -0.013909
H  -1.687047 -2.024646 0.901499
H  2.606764 1.179748 -0.887593
H  2.610218 1.184895 0.883806
H  3.973611 0.418445 -0.002433
