program: Gaussian 09
title: 000210425
version: EM64L-G09RevD.01
frameworkgroup: C1[X(C12H21NO2)]
method: RPBEPBE
basis: SDD
operation: Freq
keyword: #p
keyword: freq=noraman
keyword: PBEPBE/SDD
title: #p freq=noraman PBEPBE/SDD
converged: NO YES NO NO
title: Mulliken charges:
elementType: O O N C C C C C C C C C C C C H H H H H H H H H H H H H H H H H H H H H
charge: -0.229315 -0.229699 -0.180590 0.339379 -0.420952 -0.538266 -0.542052 -0.760091 -0.400158 0.162831 0.170416 -0.347267 -0.360622 -0.605727 -0.695635 0.210024 0.199173 0.239809 0.255689 0.256428 0.237680 0.220390 0.226962 0.209181 0.202733 0.203854 0.187220 0.192423 0.198721 0.194036 0.259448 0.245331 0.259856 0.209766 0.217004 0.212022
chargesum: 0.00000
title: Mulliken charges with hydrogens summed into heavy atoms:
elementType: O O N C C C C C C C C C C C C
charge: -0.229315 -0.229699 -0.180590 0.339379 -0.011755 -0.042768 -0.047944 -0.103559 0.006428 0.162831 0.170416 0.032376 0.032136 0.158908 -0.056843
polarizability: 1.46415600e+02 -2.37210455e+00 1.37016056e+02 -1.03143464e+01 -4.58122360e+00 1.33307255e+02
1716.lowfreq: -110.9631 -18.8376 -13.0092 -10.8636 -0.0008 -0.0006 -0.0004 18.8108 33.6480
frequency: -110.9591 16.5163 33.3677 44.5070 78.9680 96.7072 108.3099 117.1284 151.9221 209.0766 213.4494 226.8124 242.2694 261.1671 289.7535 314.8835 338.7874 363.0389 370.5095 418.6713 427.5522 455.6623 509.9645 557.9399 579.2604 609.7626 618.2313 717.0532 723.2554 746.8511 801.2861 830.2777 889.9692 892.6762 915.0635 923.6085 945.2921 964.3677 970.7921 1011.3254 1034.3105 1059.1950 1075.2957 1081.6078 1107.3763 1118.2710 1122.8454 1135.0924 1158.6823 1168.8503 1200.4739 1223.8055 1252.1444 1265.0202 1268.2929 1285.3725 1288.4500 1295.1442 1300.6963 1311.3016 1322.4359 1336.8330 1349.9787 1356.6004 1388.9834 1390.2165 1416.7950 1435.2034 1449.5590 1458.4664 1462.3035 1463.7981 1469.8621 1475.7299 1476.9989 1478.7218 1482.0605 1487.7311 1490.6485 1584.9750 1630.2294 2953.6294 2957.6971 2965.3307 2970.5326 2972.9158 2973.3131 2973.7914 2976.7816 2992.6089 3003.3188 3013.6991 3020.5997 3043.1347 3061.8989 3066.0217 3069.7292 3072.8148 3074.4903 3079.6072 3108.5222 3149.3197
redmass: 1.0457 1.6876 3.6531 5.9592 2.8866 4.2249 3.9029 1.7592 2.3502 1.4582 2.4042 1.1911 2.0320 2.7598 2.5841 2.4923 2.9722 3.4556 5.2759 3.3802 3.0281 3.1714 4.0853 3.8114 3.2991 3.7437 4.4147 3.4339 1.1182 1.1721 3.0828 1.3038 1.9970 1.9456 2.0424 2.0566 1.4659 1.8110 1.5527 3.5442 1.7873 2.8048 2.3792 2.9838 2.1927 2.0416 1.4577 1.6581 2.0763 1.6154 1.6091 1.5976 1.4330 1.6928 1.4132 1.6166 1.0787 2.1408 1.2911 1.4685 3.8171 1.7839 1.5690 1.5690 1.2050 1.2140 1.1961 1.0781 1.0830 1.0736 1.0892 1.0709 1.0719 1.0597 1.0441 1.0655 1.0633 1.0883 1.0611 10.5836 9.6186 1.0589 1.0590 1.0593 1.0634 1.0494 1.0361 1.0597 1.0566 1.0974 1.1002 1.0360 1.1033 1.1045 1.0962 1.0968 1.1006 1.0993 1.0931 1.0976 1.0971 1.1036
irintensity: 0.0020 0.0519 0.1965 0.0697 0.1566 6.3212 4.5850 0.0166 1.0565 0.1073 0.1193 0.0123 0.1768 0.7234 3.4179 1.2750 7.7989 6.6045 15.6434 1.0554 3.0220 2.3744 2.4676 3.6905 2.8529 20.5066 7.1927 2.7223 9.3300 0.1685 0.8900 3.2533 1.3375 7.6422 5.5541 4.4332 5.4068 2.1608 4.5418 1.2470 1.0255 4.1802 0.4633 1.0286 30.4845 89.6201 14.0332 5.7176 9.0880 3.4638 0.9392 1.3958 3.8938 50.6697 9.7524 6.0996 2.3501 107.3056 7.3275 16.7191 81.7659 25.1065 1.2151 3.1717 23.1546 7.7074 86.4389 6.0147 8.1228 2.4980 17.3114 0.6104 0.4332 6.9064 12.2755 1.8008 15.4161 23.5925 12.8401 425.1428 57.8821 1.3253 18.0397 13.0589 10.5339 32.0967 43.1176 57.0684 45.5891 0.7243 6.2948 24.8957 1.1576 83.2981 5.4003 41.3886 94.6452 52.5841 3.7081 37.9063 13.5831 0.4239
temp: 298.150 k
press: 1.00000 atm
elementType: 8 8 7 6 6 6 6 6 6 6 6 6 6 6 6 1 1 1 1 1 1 1 1 1 1 1 1 1 1 1 1 1 1 1 1 1
symmnumber: 1
zpe: 817325.5 jmol-1
zpe.correction: 0.311303 hartree
zpe.thermalcorrener: 0.327857 hartree
zpe.thermalcorrenthalpy: 0.328801 hartree
zpe.thermalcorrgfe: 0.265553 hartree
zpe.sumelectzpe: -673.911813 hartree
zpe.sumelectthermal: -673.895259 hartree
zpe.sumelectthermalent: -673.894315 hartree
zpe.sumelectthermalfe: -673.957563 hartree
dipole: -1.7500 2.5196 0.5183
dipole: 3.1112
quadrupole: -96.2712 -90.0460 -104.5478
quadrupole: 1.1718 5.8109 6.4313
quadrupole: 0.6838 6.9090 -7.5928 1.1718 5.8109 6.4313
hfenergy: -674.2231156 hartree
pointgroup: C01 [X(C12H21N1O2)]
dipole: -0.7069952 0.911561 0.409274 debye
polarizability: 146.8765149|0.197531|138.8615715|-10.2065133|-3.3812453|131.000825 unknown
InChI: InChI=1S/C12H21NO2/c1-4-5-6-7-12(2)8-10(14)13(3)11(15)9-12/h4-9H2,1-3H3
charge 0 multiplicity 1
36 atoms
O  2.969335 0.43912 -1.982701
O  1.404991 -2.139389 1.570492
N  2.182834 -0.852747 -0.209829
C  0.382394 1.296146 0.56316
C  -0.760289 0.767336 -0.362981
C  1.636438 1.603746 -0.297779
C  0.820818 0.233927 1.606229
C  -0.058891 2.587495 1.294103
C  -2.092515 0.395289 0.327506
C  2.306441 0.379383 -0.911201
C  1.467546 -1.010841 1.00991
C  -3.134605 -0.155212 -0.674343
C  -4.485069 -0.511795 -0.012454
C  2.837289 -2.051451 -0.791203
C  -5.519871 -1.062261 -1.017701
H  -0.396899 -0.120289 -0.920919
H  -0.961754 1.546156 -1.127693
H  2.398745 2.115455 0.326491
H  1.402716 2.286806 -1.133198
H  -0.019127 -0.11332 2.230402
H  1.55883 0.688021 2.300515
H  -0.388663 3.356118 0.570307
H  -0.896831 2.394083 1.986796
H  0.773255 3.013629 1.886193
H  -1.918371 -0.368262 1.112293
H  -2.520539 1.282018 0.835792
H  -3.306774 0.593513 -1.475928
H  -2.722988 -1.056731 -1.17427
H  -4.312135 -1.259125 0.788558
H  -4.895785 0.389845 0.486521
H  2.257993 -2.940883 -0.504365
H  3.864956 -2.156351 -0.402049
H  2.882547 -1.930313 -1.883067
H  -5.731789 -0.323052 -1.813199
H  -6.476331 -1.307873 -0.520946
H  -5.1466 -1.982092 -1.505939
