program: Gaussian 09
title: 000208188
version: EM64L-G09RevD.01
frameworkgroup: C1[X(C7H12N2S)]
method: RPBEPBE
basis: SDD
operation: Freq
keyword: #p
keyword: freq=noraman
keyword: PBEPBE/SDD
title: #p freq=noraman PBEPBE/SDD
converged: YES YES NO NO
title: Mulliken charges:
elementType: S N N C C C C C C C H H H H H H H H H H H H
charge: 0.168712 -0.052014 -0.575392 -0.464146 -0.340807 -0.202020 0.262751 -0.688744 -0.762312 -0.176403 0.204937 0.212022 0.206348 0.214546 0.210189 0.210385 0.222185 0.240202 0.239904 0.214031 0.331113 0.324514
chargesum: 0.00000
title: Mulliken charges with hydrogens summed into heavy atoms:
elementType: S N N C C C C C C C
charge: 0.168712 -0.052014 0.080235 -0.047188 0.080087 -0.202020 0.262751 -0.045985 -0.068175 -0.176403
polarizability: 1.40594977e+02 -2.57369826e+00 1.13153781e+02 7.69309319e+00 2.53825895e+00 6.43121729e+01
1716.lowfreq: -10.7441 -7.2696 -3.2916 -0.0017 -0.0012 0.0010 36.0824 72.0837 78.4395
frequency: 35.8108 72.0475 78.4379 118.0573 183.2346 199.1604 227.1579 260.4915 268.4292 281.3003 308.9076 364.0238 404.2481 426.1746 515.9529 559.7968 579.0636 586.7046 617.4573 659.1396 735.6968 836.1576 884.5636 901.6328 968.1009 1041.3988 1048.3563 1075.4270 1094.5389 1114.7679 1175.4205 1230.4817 1265.8073 1276.4345 1290.4982 1307.5179 1337.7106 1389.7300 1398.5565 1453.6697 1458.3082 1471.0653 1473.2848 1477.9996 1485.3130 1570.6609 1586.3229 1627.4952 2962.9813 2972.4411 2985.2012 2986.5455 3018.5256 3042.3478 3065.0751 3071.1906 3074.2190 3103.3961 3561.5415 3714.6487
redmass: 2.5948 2.0483 3.7128 1.0532 3.7438 4.6636 1.1161 2.7614 1.4062 1.9713 2.8814 2.5504 1.6176 3.1077 6.2757 4.6613 4.5234 6.8757 5.9162 3.9140 1.1649 1.6891 1.9540 1.9283 1.7999 1.4806 2.8809 1.9362 2.0785 1.7151 3.2223 1.3549 2.6715 1.3788 1.1792 5.7055 1.5035 1.2135 1.2737 1.0850 1.0468 1.0781 1.0754 1.0432 1.0754 2.7079 3.1685 2.1997 1.0624 1.0359 1.0614 1.0371 1.0949 1.1013 1.0982 1.1016 1.0990 1.0980 1.0449 1.1047
irintensity: 0.1573 0.4820 1.6428 0.0192 0.1803 7.6346 0.0182 3.6233 83.1588 32.1915 3.4042 55.0452 134.6347 42.5037 3.7048 5.6578 17.4733 6.4909 4.1072 1.2554 4.3116 6.7188 11.3275 3.9746 7.1132 5.1989 0.0740 3.6259 6.5591 7.3886 18.3553 1.8325 104.1730 5.8197 12.6301 18.8475 0.8314 11.5679 21.8301 1.0090 11.4351 1.9197 13.1043 13.5914 15.5981 85.2089 6.5668 402.8754 24.1249 48.5063 32.5215 32.9274 5.9094 7.7526 16.9696 79.0805 47.9534 24.9042 102.2599 43.7483
temp: 298.150 k
press: 1.00000 atm
elementType: 16 7 7 6 6 6 6 6 6 6 1 1 1 1 1 1 1 1 1 1 1 1
symmnumber: 1
zpe: 474203.5 jmol-1
zpe.correction: 0.180615 hartree
zpe.thermalcorrener: 0.192594 hartree
zpe.thermalcorrenthalpy: 0.193538 hartree
zpe.thermalcorrgfe: 0.142191 hartree
zpe.sumelectzpe: -780.730393 hartree
zpe.sumelectthermal: -780.718413 hartree
zpe.sumelectthermalent: -780.717469 hartree
zpe.sumelectthermalfe: -780.768817 hartree
dipole: 0.3942 -1.0725 0.1102
dipole: 1.1480
quadrupole: -55.7147 -65.0508 -71.1266
quadrupole: -8.2488 1.6825 -0.5471
quadrupole: 8.2493 -1.0868 -7.1625 -8.2488 1.6825 -0.5471
hfenergy: -780.9110077 hartree
pointgroup: C01 [X(C7H12N2S1)]
dipole: 0.1573224 0.4139204 -0.0889189 debye
dipolederiv: -0.4549235 0.0388852 0.089498 0.2376382 -0.4746608 -0.0209914 0.106353 0.0084507 0.0295501 -0.7831058 -0.0513867 0.0616365 -0.4492478 -1.0092389 0.0778679 0.111513 0.0217144 -0.2426817 -1.4403677 -0.4836388 0.1032916 -0.4847089 -0.4089054 0.0665428 0.1381667 0.0809375 -0.7440292 0.0472888 -0.0126402 -0.0209992 -0.0319863 0.0664315 0.0501442 -0.066117 0.0503027 0.1588513 0.0390325 0.0068083 0.0165963 -0.0025667 0.133033 0.021806 0.1029045 0.0208674 0.0857179 0.0762245 0.1707427 -0.050811 0.247805 0.2103659 -0.0196169 -0.121692 -0.0229374 -0.2349799 0.4476477 0.0706747 -0.0709562 0.0658366 0.3793355 -0.0349701 -0.0719696 -0.0150716 -0.0056228 -0.0982903 0.0203893 -0.0007482 0.0457224 0.0960463 0.0139471 -0.0658147 0.0200694 0.0683914 0.0643977 0.045571 0.0047867 -0.0612599 -0.0994169 0.015483 0.0057769 -0.0083588 0.0925056 1.606145 0.1946544 -0.2437625 0.3956325 0.9865133 -0.0645882 -0.2789013 -0.0596408 0.1220988 -0.0003844 -0.0756165 0.0129266 -0.0857559 -0.1053543 0.0742027 -0.0059575 0.0390586 0.0623493 -0.0229223 0.036329 0.0438183 0.0818081 0.0112848 -0.1274201 0.0608316 -0.0759864 -0.0869639 0.0067779 -0.0941429 0.0160332 -0.0855781 -0.1110786 0.0689544 0.0058682 0.0277241 0.0553786 0.0316734 0.0426849 0.0423268 0.0233831 0.006309 -0.1195646 0.0241413 -0.0819664 -0.1019366 0.0318911 -0.0454275 0.0191751 -0.126414 -0.1394433 0.0485953 0.0512313 0.0444521 0.0812267 0.0583146 0.0043647 0.0175584 0.035784 0.0058426 -0.1226709 0.0885773 -0.1298664 -0.0913693 -0.0712223 0.0600227 -0.0984814 0.0819514 0.0575886 0.0793648 -0.1396012 0.0824641 -0.0611656 0.0961185 0.0234642 0.0539567 0.0135407 -0.0228894 -0.0642941 0.0429023 -0.1263681 -0.0554666 0.0508505 0.059761 -0.0967665 0.0341246 -0.0172016 0.0645338 -0.0827957 0.1138074 -0.0205439 -0.1429987 -0.0858785 0.0408929 0.0048268 0.0948589 -0.006557 0.040671 0.015373 0.093216 0.2431577 0.0140212 0.0279243 -0.0308949 0.1536608 0.0086641 0.0258246 0.0026813 0.3977304 0.2146951 0.0603576 0.0321035 0.0903592 0.1869189 -0.009433 0.0280871 -0.0077068 0.3977436 unknown
polarizability: 140.8116079|1.658854|113.0871787|-6.8651919|-3.0097473|64.1621452 unknown
InChI: InChI=1S/C7H12N2S/c1-3-4-6-5(2)9-7(8)10-6/h3-4,8H2,1-2H3
charge 0 multiplicity 1
22 atoms
S  0.640805 1.548018 0.107062
N  1.91366 -0.80579 -0.056733
N  3.368418 1.074332 -0.344904
C  -1.790799 0.049373 0.541527
C  -2.609151 0.631845 -0.645682
C  -0.306576 -0.0183 0.300522
C  0.550563 -1.10219 0.179287
C  -4.12174 0.677202 -0.343481
C  0.173485 -2.559616 0.273799
C  2.137884 0.49424 -0.121367
H  -2.155738 -0.97306 0.75926
H  -2.008517 0.651888 1.447773
H  -2.240742 1.651364 -0.873684
H  -2.416397 0.021341 -1.54877
H  -4.519566 -0.335478 -0.141527
H  -4.331315 1.303204 0.544719
H  -4.688383 1.098036 -1.193938
H  0.444544 -3.085456 -0.659834
H  0.730174 -3.046749 1.095132
H  -0.904981 -2.698597 0.451892
H  4.169591 0.459374 -0.466445
H  3.490784 2.081017 -0.379204
