program: Gaussian 09
title: 000210424
version: EM64L-G09RevD.01
frameworkgroup: C1[X(C12H21NO2)]
method: RPBEPBE
basis: SDD
operation: Freq
keyword: #p
keyword: freq=noraman
keyword: PBEPBE/SDD
title: #p freq=noraman PBEPBE/SDD
converged: YES YES NO NO
title: Mulliken charges:
elementType: O O N C C C C C C C C C C C C H H H H H H H H H H H H H H H H H H H H H
charge: -0.213466 -0.213934 -0.347320 0.367479 -0.458565 -0.539839 -0.547964 -0.409307 -0.756911 -0.366664 0.120225 0.120872 -0.357328 -0.356752 -0.695612 0.198068 0.210229 0.256345 0.248009 0.246422 0.261692 0.209709 0.209745 0.218542 0.225341 0.230411 0.190026 0.191338 0.189428 0.189745 0.350440 0.195697 0.195706 0.217162 0.210404 0.210627
chargesum: 0.00000
title: Mulliken charges with hydrogens summed into heavy atoms:
elementType: O O N C C C C C C C C C C C C
charge: -0.213466 -0.213934 0.003120 0.367479 -0.050268 -0.035485 -0.039851 0.010148 -0.082617 0.014701 0.120225 0.120872 0.021845 0.034651 -0.057420
polarizability: 1.72677483e+02 5.57373710e+00 1.41739929e+02 -1.50601339e+00 1.57441015e+00 1.07076941e+02
1716.lowfreq: -8.4203 -3.0528 0.0003 0.0004 0.0007 9.2080 32.6941 48.9227 49.6626
frequency: 32.4072 48.7415 49.4052 79.2134 88.3179 114.7110 126.0021 140.7785 149.6445 174.1978 194.8289 232.6079 240.4331 269.7473 312.6450 334.5858 342.0393 397.5591 419.0701 436.9242 453.7050 515.8540 535.3938 557.9829 588.2199 625.4228 724.4982 737.9998 783.8696 793.1675 807.6790 851.5104 873.0406 889.9188 891.7055 908.9039 919.8860 957.4139 975.3225 983.5185 1012.5164 1034.3394 1060.2823 1068.6259 1080.8085 1109.5669 1134.7673 1140.6415 1161.3861 1195.0385 1219.1667 1238.9585 1250.6216 1258.3673 1274.4248 1280.4049 1289.1436 1293.9870 1298.1534 1314.4296 1322.8104 1330.7609 1336.5647 1355.8431 1360.1835 1370.6380 1390.2291 1396.9780 1433.0970 1441.9078 1457.0593 1462.9256 1465.8519 1473.7672 1478.0193 1479.8511 1482.3482 1487.0619 1489.1529 1636.5413 1640.1211 2945.3943 2951.9515 2956.1896 2967.2858 2971.7782 2973.2242 2973.5966 2975.2390 2982.3682 2988.1539 2995.9635 3006.0135 3027.4431 3044.4011 3067.9053 3069.5714 3072.5485 3072.6716 3078.3218 3084.1179 3483.4149
redmass: 3.9276 1.9003 3.2014 3.2592 2.9768 2.0629 2.9651 2.6248 3.9679 2.5683 4.1654 1.1253 1.2138 2.3143 2.3585 3.0300 3.6632 2.8547 3.4382 3.0936 3.8717 4.4276 2.6037 4.1864 3.3269 4.0326 1.0653 1.1131 1.2405 1.8397 1.7274 4.3128 1.3706 1.8714 1.7757 2.4824 2.3324 1.7419 1.9588 1.4278 3.1214 2.8636 1.5203 2.6249 2.1977 2.0473 1.8029 1.6143 1.8610 1.6130 1.4899 1.4633 1.6831 2.2570 1.3782 1.5382 1.0610 1.4537 1.2409 2.2366 2.0574 1.5789 1.4190 1.6418 1.5200 1.8444 1.2163 1.2003 1.0828 1.0798 1.0789 1.0685 1.0750 1.0735 1.0423 1.0609 1.0743 1.0644 1.0858 9.9598 5.7320 1.0595 1.0589 1.0588 1.0592 1.0625 1.0385 1.0610 1.0640 1.0395 1.0965 1.0983 1.1020 1.1041 1.1044 1.0941 1.1006 1.0990 1.0993 1.0933 1.0979 1.0760
irintensity: 0.7037 0.3591 0.4162 0.0795 0.8831 2.1234 2.9802 0.4706 2.9636 0.6494 0.1777 0.0003 0.0652 0.4200 0.3130 7.8301 9.5372 8.9471 0.2681 1.6568 9.7683 3.4531 3.5919 15.1502 6.0211 0.8114 12.0532 0.0475 2.0032 46.9896 62.2411 8.0512 0.4319 3.3249 2.6517 2.6552 5.3921 1.3469 1.4323 0.5799 0.7741 4.2214 3.5737 1.7409 0.2790 14.1008 16.5655 21.3547 9.4167 2.1494 10.4720 0.7102 10.2530 138.9837 10.0576 89.4106 0.3139 25.7696 7.6353 64.6943 61.8492 9.4739 2.1456 2.3593 1.8924 10.3880 11.0533 22.3492 4.3153 4.4044 2.4992 0.0315 0.3461 0.9367 12.5144 7.7726 0.5285 0.5386 31.9008 178.6962 433.2984 16.5073 3.3607 12.7438 38.8708 27.5824 25.5163 79.8344 30.2000 10.4972 1.4739 10.6754 1.6974 4.5168 118.2942 5.6993 91.1528 63.4832 31.2774 2.2918 32.8051 36.6690
temp: 298.150 k
press: 1.00000 atm
elementType: 8 8 7 6 6 6 6 6 6 6 6 6 6 6 6 1 1 1 1 1 1 1 1 1 1 1 1 1 1 1 1 1 1 1 1 1
symmnumber: 1
zpe: 820959.8 jmol-1
zpe.correction: 0.312687 hartree
zpe.thermalcorrener: 0.329561 hartree
zpe.thermalcorrenthalpy: 0.330505 hartree
zpe.thermalcorrgfe: 0.267235 hartree
zpe.sumelectzpe: -673.917340 hartree
zpe.sumelectthermal: -673.900466 hartree
zpe.sumelectthermalent: -673.899522 hartree
zpe.sumelectthermalfe: -673.962793 hartree
dipole: 4.1008 -1.1722 -0.2509
dipole: 4.2724
quadrupole: -111.4219 -107.4026 -90.1983
quadrupole: -1.9334 -0.1199 -0.5717
quadrupole: -8.4143 -4.3950 12.8093 -1.9334 -0.1199 -0.5717
hfenergy: -674.2300275 hartree
pointgroup: C01 [X(C12H21N1O2)]
dipole: 1.6144551 -0.4555642 -0.1067129 debye
polarizability: 172.6520963|5.6716492|141.6966168|-1.3913559|2.2074913|107.1456394 unknown
InChI: InChI=1S/C12H21NO2/c1-3-4-5-6-7-12(2)8-10(14)13-11(15)9-12/h13H,3-9H2,1-2H3
charge 0 multiplicity 1
36 atoms
O  -4.394967 -1.723195 -0.189511
O  -3.023539 2.697679 -0.053768
N  -3.641013 0.467395 -0.150764
C  -0.923796 -0.388021 0.188861
C  0.487925 -0.852516 -0.284086
C  -1.973646 -1.354166 -0.434096
C  -1.224232 1.044646 -0.338169
C  1.69256 -0.013772 0.199603
C  -1.027527 -0.427787 1.73673
C  3.037269 -0.571805 -0.321858
C  -3.421805 -0.925717 -0.241849
C  -2.6698 1.49386 -0.162732
C  4.261589 0.247228 0.144584
C  5.604512 -0.313539 -0.376936
C  6.823918 0.508855 0.092547
H  0.496159 -0.872427 -1.395287
H  0.632473 -1.902832 0.045786
H  -1.878899 -2.372888 -0.019488
H  -1.799541 -1.438731 -1.527416
H  -0.993715 1.099245 -1.423102
H  -0.5960 1.804232 0.156222
H  1.586859 1.037149 -0.137821
H  1.720846 0.010561 1.306998
H  -0.772388 -1.434313 2.116747
H  -0.337317 0.297019 2.20272
H  -2.04747 -0.185409 2.087497
H  3.017305 -0.600398 -1.431654
H  3.151899 -1.624037 0.013447
H  4.284615 0.276146 1.254152
H  4.150589 1.299637 -0.191053
H  -4.617977 0.768232 -0.041341
H  5.71508 -1.365033 -0.041292
H  5.58081 -0.342447 -1.485541
H  7.769856 0.089175 -0.296205
H  6.890132 0.52458 1.196867
H  6.752039 1.557393 -0.253189
