program: Gaussian 09
title: 000210478
version: EM64L-G09RevD.01
frameworkgroup: C1[X(C22H27FN2O2)]
method: RPBEPBE
basis: SDD
operation: Freq
keyword: #p
keyword: freq=noraman
keyword: PBEPBE/SDD
title: #p freq=noraman PBEPBE/SDD
converged: NO YES NO NO
title: Mulliken charges:
elementType: F O O N N C C C C C C C C C C C C C C C C C C C C C C H H H H H H H H H H H H H H H H H H H H H H H H H H H
charge: -0.196582 -0.279420 -0.220754 -0.089912 -0.078172 -0.386427 -0.382091 -0.344792 -0.380663 -0.409600 -0.349577 -0.164233 -0.540759 0.441683 0.117342 -0.426712 -0.381610 0.292698 -0.510745 -0.225365 -0.229793 -0.243550 -0.306319 -0.317080 -0.389301 -0.373497 0.333508 0.204946 0.184555 0.194326 0.232428 0.183131 0.192139 0.208655 0.190174 0.217777 0.224734 0.235527 0.192466 0.192468 0.253975 0.238346 0.240533 0.261893 0.223476 0.230109 0.200217 0.226112 0.224937 0.227666 0.254619 0.284524 0.259822 0.262170
chargesum: 0.00000
title: Mulliken charges with hydrogens summed into heavy atoms:
elementType: F O O N N C C C C C C C C C C C C C C C C C C C C C C
charge: -0.196582 -0.279420 -0.220754 -0.089912 -0.078172 0.003074 0.044662 0.030478 0.018165 0.032911 0.078415 0.028236 -0.048438 0.441683 0.117342 -0.186179 -0.119717 0.292698 0.143056 0.000747 -0.004856 -0.015884 -0.051700 -0.032556 -0.129480 -0.111326 0.333508
polarizability: 3.30225454e+02 1.69888597e+01 2.61925150e+02 1.39635865e+01 -1.01865670e+01 1.74192283e+02
1716.lowfreq: -6.4342 -1.5247 -0.0013 -0.0005 0.0006 11.4617 14.0053 17.4704 18.8280
frequency: 12.2615 17.1501 18.6485 31.3498 35.5154 46.1748 55.1318 68.6488 83.3696 94.3192 111.7798 119.6810 136.2475 152.9293 163.1714 179.7127 214.8545 226.9354 243.6774 253.5797 274.3727 283.4872 288.5122 326.0644 341.9007 367.0082 392.5275 402.8578 404.8371 411.3964 414.3244 443.6962 475.3580 480.7205 489.4330 503.0827 559.7220 568.4111 576.7278 594.9278 614.8527 619.2238 624.9827 707.7452 721.9810 726.9736 759.8603 767.9113 774.2046 792.0032 795.3184 821.0369 825.3167 848.0683 851.7317 859.4976 899.7066 918.5998 928.1153 954.6638 974.7282 980.6094 986.7371 988.8853 993.2735 997.3204 1004.2760 1010.2150 1020.7763 1024.6825 1036.2230 1038.4125 1054.9792 1065.3600 1081.4164 1086.1448 1097.8071 1104.8646 1117.9700 1129.5018 1139.3281 1143.7277 1149.5045 1156.3060 1161.8870 1171.2147 1182.5834 1187.4767 1196.7296 1201.4218 1208.1485 1212.3470 1242.7309 1273.2928 1274.1424 1285.6097 1292.6286 1294.7382 1305.6493 1309.2495 1312.7729 1333.7761 1339.6957 1346.4287 1360.0420 1370.6635 1380.4197 1384.3016 1388.0475 1394.2288 1410.4680 1431.3340 1434.2580 1443.5129 1453.0743 1455.6323 1456.8003 1461.3753 1465.9532 1471.6715 1475.1322 1477.9711 1481.0047 1491.4057 1571.8337 1592.9929 1601.4611 1611.0903 1612.8571 2848.1650 2858.0255 2863.9461 2870.2534 2880.6661 2928.1228 2936.7636 2950.6318 2971.3174 3019.0266 3020.7587 3028.0009 3030.2125 3034.7730 3043.9036 3052.3890 3064.3494 3101.1409 3118.8690 3123.7720 3135.8997 3145.5504 3154.5538 3157.2172 3161.7921 3177.4507 3180.4344
redmass: 6.9810 4.9110 4.6932 3.9001 4.5692 4.3755 3.8481 4.2913 3.4739 4.5952 3.0939 3.6127 3.7690 4.4936 1.7662 2.9458 2.7467 2.4192 2.6773 2.7818 3.4439 5.5542 4.6071 2.4168 2.7245 7.5841 3.2664 2.5507 2.6685 2.9431 4.3218 3.2416 3.4357 3.2364 4.9224 3.2454 2.6200 2.2636 6.3736 4.9215 5.7963 2.2373 7.1411 1.7520 3.2354 4.5587 2.7713 3.8700 2.2484 1.9999 2.7279 1.5804 2.4921 1.5474 1.5535 1.2552 3.8606 2.1215 1.5580 1.3608 3.9913 1.4148 2.3975 1.7338 2.7092 1.3152 2.6916 2.4092 2.9684 2.2549 2.2654 3.0428 1.9620 2.5125 1.7196 2.4094 2.1628 1.3180 1.2663 2.3982 1.8068 2.4797 2.6972 1.4093 1.6220 1.0575 1.1225 1.3500 1.1712 2.0120 2.3550 1.7716 1.8614 1.3612 1.2698 1.4451 1.2936 1.3580 1.5118 1.5406 1.4178 1.3115 1.3523 1.4209 1.4671 1.4719 5.4504 1.7601 2.9835 1.5398 3.9745 1.2128 1.1044 1.8793 1.0852 1.0855 1.0551 1.0883 1.0863 1.1311 1.1178 1.0599 2.0895 2.5801 8.0785 6.0664 7.2421 6.0597 7.1908 1.0710 1.0704 1.0700 1.0707 1.0693 1.0685 1.0355 1.0813 1.0598 1.1009 1.0955 1.0908 1.0892 1.0884 1.0935 1.0905 1.0888 1.0988 1.0848 1.0872 1.0918 1.0963 1.0887 1.0891 1.1015 1.0964 1.0974
irintensity: 0.2391 0.4408 0.4287 0.0737 0.0799 0.1456 0.6848 1.6984 1.1058 4.0401 3.2859 0.3303 0.3318 0.8213 2.1002 8.8000 1.0906 4.9221 3.1351 2.6349 9.2020 1.2133 1.5050 8.3044 1.7835 1.8943 4.8213 1.9755 1.0245 0.0193 3.3342 2.3397 2.0397 6.2947 1.0591 5.5004 16.5353 10.8353 45.2719 9.1649 0.1519 0.8485 0.3623 60.1840 0.2041 4.3332 13.3549 8.4564 29.6231 4.5131 28.9491 17.7694 21.3839 14.6644 41.6217 0.0815 11.4674 19.4156 8.3683 0.4728 56.8226 0.0258 12.6948 1.8255 16.3037 0.6221 0.5195 23.1311 40.0844 2.8040 31.6275 71.9669 4.0735 9.9334 9.5467 1.1225 2.7028 14.9836 0.1291 110.6053 5.5090 1.7970 69.3091 79.0661 3.6146 0.1111 0.3454 3.9263 2.3512 5.1174 37.3612 50.5286 80.8242 8.3509 4.7336 11.9778 5.1623 12.8706 46.3457 82.2152 33.7079 3.6302 60.1012 21.9941 16.0326 18.4258 20.0722 0.2091 3.4221 15.3908 22.6104 5.1024 11.3149 11.0009 1.2962 2.5684 7.9516 6.6942 0.5527 24.4478 4.5476 9.0282 11.0270 25.0631 122.4155 0.7585 80.2524 2.6345 57.4495 74.4662 15.1907 27.3693 72.1839 227.8634 35.1397 72.1745 73.7145 32.3967 51.0672 10.3063 23.8882 50.4886 40.0611 47.8931 28.8341 20.9066 34.2018 3.8356 0.4008 13.5439 35.7600 7.0961 0.1250 24.3499 3.9176 4.5363
temp: 298.150 k
press: 1.00000 atm
elementType: 9 8 8 7 7 6 6 6 6 6 6 6 6 6 6 6 6 6 6 6 6 6 6 6 6 6 6 1 1 1 1 1 1 1 1 1 1 1 1 1 1 1 1 1 1 1 1 1 1 1 1 1 1 1
symmnumber: 1
zpe: 1170709.8 jmol-1
zpe.correction: 0.445900 hartree
zpe.thermalcorrener: 0.471863 hartree
zpe.thermalcorrenthalpy: 0.472807 hartree
zpe.thermalcorrgfe: 0.385308 hartree
zpe.sumelectzpe: -1212.274330 hartree
zpe.sumelectthermal: -1212.248367 hartree
zpe.sumelectthermalent: -1212.247423 hartree
zpe.sumelectthermalfe: -1212.334922 hartree
dipole: 1.3684 -1.3196 -0.6315
dipole: 2.0032
quadrupole: -166.6297 -158.3543 -158.1969
quadrupole: 7.9406 -2.0411 2.9820
quadrupole: -5.5694 2.7060 2.8634 7.9406 -2.0411 2.9820
hfenergy: -1212.7202301 hartree
pointgroup: C01 [X(C22H27F1N2O2)]
dipole: -0.4968094 0.2690349 0.5494604 debye
polarizability: 332.7902215|5.8014604|173.4190531|12.6553623|-12.056089|260.1336111 unknown
InChI: InChI=1S/C22H27FN2O2/c1-27-22(19-5-3-2-4-6-19)17-25-15-13-24(14-16-25)12-11-21(26)18-7-9-20(23)10-8-18/h2-10,22H,11-17H2,1H3
charge 0 multiplicity 1
54 atoms
F  9.33512 -0.644122 0.523698
O  -5.678535 0.33178 2.505598
O  3.832351 0.371517 -2.609456
N  -2.276307 0.022278 1.006951
N  0.322147 -0.228981 -0.271536
C  -1.024722 0.091204 1.795778
C  -2.08716 -0.840524 -0.184999
C  0.125095 0.627723 0.925898
C  -0.940447 -0.303052 -1.053702
C  -3.48285 -0.29379 1.803423
C  1.463088 0.199513 -1.116775
C  -4.675905 0.639576 1.465508
C  2.816219 -0.071447 -0.435906
C  -5.237197 0.447612 0.060725
C  4.003787 0.084173 -1.387151
C  -4.941483 1.370139 -0.971916
C  -6.045734 -0.680672 -0.234437
C  5.393089 -0.116886 -0.844775
C  -6.79288 1.282029 2.527065
C  -5.431141 1.164272 -2.282705
C  -6.541561 -0.88506 -1.540425
C  -6.232063 0.035128 -2.571174
C  5.642921 -0.483178 0.505929
C  6.494007 0.066067 -1.727075
C  6.961166 -0.662999 0.972872
C  7.816916 -0.106752 -1.28056
C  8.01738 -0.468409 0.065164
H  -1.177978 0.772484 2.653098
H  -0.728616 -0.911373 2.196569
H  -1.851664 -1.893617 0.112753
H  -3.018758 -0.851918 -0.775547
H  -0.106885 1.68423 0.63307
H  1.052506 0.635591 1.527687
H  -0.781583 -0.979934 -1.913665
H  -1.235376 0.700996 -1.451536
H  -3.806161 -1.351712 1.680424
H  -3.268311 -0.145637 2.877872
H  1.427435 -0.37391 -2.060137
H  1.396633 1.278673 -1.403705
H  -4.323761 1.68872 1.581016
H  2.803386 -1.103894 -0.02964
H  2.971368 0.598339 0.43324
H  -4.318499 2.244944 -0.749874
H  -6.292015 -1.381932 0.571624
H  -7.374057 1.255573 1.583626
H  -7.437173 0.975597 3.366517
H  -6.431364 2.318454 2.697183
H  -5.192045 1.883284 -3.074639
H  -7.167925 -1.758216 -1.756975
H  -6.615285 -0.124067 -3.585488
H  4.812137 -0.634653 1.201571
H  6.280386 0.344897 -2.763851
H  7.174984 -0.946284 2.007238
H  8.675217 0.030923 -1.944148
