program: Gaussian 09
title: 000208172
version: EM64L-G09RevD.01
frameworkgroup: C1[X(C14H19ClN2O2)]
method: RPBEPBE
basis: SDD
operation: Freq
keyword: #p
keyword: freq=noraman
keyword: PBEPBE/SDD
title: #p freq=noraman PBEPBE/SDD
converged: YES YES NO NO
title: Mulliken charges:
elementType: Cl O O N N C C C C C C C C C C C C C C H H H H H H H H H H H H H H H H H H H
charge: -0.064789 -0.322301 -0.260193 -0.054625 -0.468464 0.003490 -0.479662 -0.470163 -0.442545 -0.310639 -0.670043 0.249609 0.419158 0.371010 -0.304743 -0.398867 -0.820735 -0.246003 -0.227479 0.264930 0.251384 0.226918 0.259802 0.204596 0.232136 0.228500 0.181880 0.207392 0.230966 0.207551 0.205959 0.331386 0.236685 0.227955 0.219033 0.289155 0.257518 0.234237
chargesum: 0.00000
title: Mulliken charges with hydrogens summed into heavy atoms:
elementType: Cl O O N N C C C C C C C C C C C C C C
charge: -0.064789 -0.322301 -0.260193 -0.054625 -0.137078 0.268421 -0.001360 -0.005764 0.018091 0.078633 -0.025567 0.249609 0.419158 0.371010 -0.304743 -0.162183 -0.084592 0.011514 0.006758
polarizability: 2.50821719e+02 -2.31513712e+00 1.81407294e+02 9.04318288e+00 -1.41436222e+00 1.16048581e+02
1716.lowfreq: -19.2438 -1.1469 -0.0015 -0.0010 0.0009 3.9128 10.4104 29.3670 31.2261
frequency: -13.1921 29.0475 31.1105 57.9131 67.0442 86.6851 91.6702 125.4284 149.1977 157.6440 187.5107 198.1673 212.3912 229.1911 256.5357 297.2494 301.4148 317.6327 343.7314 375.3950 394.4230 430.3628 438.8581 465.9278 509.6809 521.8871 541.4124 603.8690 609.9679 633.6378 664.1389 690.0854 715.4298 734.5681 757.2953 772.5821 789.1460 800.2915 822.6866 862.4832 879.0372 895.6748 897.4412 926.5362 941.9480 969.4118 986.0817 993.8926 997.4369 1043.0550 1050.0862 1052.3758 1064.9099 1082.0779 1085.8122 1101.4247 1140.4835 1154.6944 1164.8197 1165.5579 1185.6027 1201.2465 1237.7679 1243.0567 1278.7650 1283.8880 1288.2235 1295.3203 1310.7125 1318.8806 1338.5629 1361.9256 1365.3514 1387.5455 1400.0280 1416.1987 1454.5396 1455.3228 1457.5756 1466.5672 1467.5220 1469.6839 1475.1630 1480.7400 1486.4816 1497.0763 1572.4828 1609.5228 1665.5270 2857.7089 2982.2573 2985.0680 2995.0055 3007.8735 3015.5223 3023.4304 3063.5604 3068.7978 3073.6603 3079.9837 3082.9127 3092.4987 3093.4588 3094.0598 3135.3020 3156.1913 3177.5926 3514.4307
redmass: 3.9710 3.7951 4.1843 5.0476 5.2165 6.3270 2.2184 3.6564 3.8472 2.8970 1.3482 4.4240 2.1744 1.5838 3.4469 4.8608 3.5070 3.0836 2.9550 3.8843 3.4554 2.6465 2.6908 3.4109 3.9660 4.2706 3.7299 1.5099 3.1868 3.7576 4.2475 4.6924 5.3285 4.4531 3.3070 1.2809 3.5510 1.2404 5.0743 2.2090 4.1359 1.3498 2.2725 3.6408 2.3025 1.3332 1.8175 2.8696 2.2273 2.2154 2.6337 1.5366 2.1035 2.1225 1.8017 1.8794 2.5093 1.4163 2.1279 1.9127 1.5416 1.3452 2.1375 1.6019 1.2826 1.9305 1.2565 1.4318 1.2386 1.3244 1.3365 1.4095 5.6446 1.2317 1.2304 2.1411 1.0886 1.0997 1.0752 1.0560 2.6833 1.0805 1.0813 1.1743 1.0678 2.0866 5.8039 6.8953 8.2261 1.0703 1.0359 1.0364 1.0654 1.0621 1.0634 1.0883 1.0933 1.0969 1.0988 1.0984 1.0988 1.1028 1.1000 1.1002 1.0875 1.0928 1.0984 1.0754
irintensity: 0.1999 0.7715 0.6657 0.7782 1.3928 2.9573 0.6311 0.7623 1.8108 1.4099 1.4980 6.6268 0.5667 1.9890 11.5943 5.5619 1.6714 1.3969 6.5000 9.4733 2.9390 3.9987 1.3584 1.3407 1.5905 2.2521 8.0738 66.6245 12.8242 7.7085 17.1288 9.0284 58.8574 2.5622 4.9595 61.8297 8.5884 7.1879 20.0857 6.9390 11.7492 0.1845 21.4832 7.6795 3.5438 1.1386 52.8359 74.8551 156.8732 35.8283 29.7402 9.5355 8.6538 102.7189 5.5095 5.2646 42.8321 87.1703 224.6146 126.8208 57.5977 3.0420 2.5855 12.9689 11.9927 25.3855 14.9280 4.5696 6.3474 7.4033 6.4636 26.7516 42.5015 22.2034 23.5322 39.9021 15.2619 39.2032 4.9270 17.3066 10.0901 4.6103 3.6583 37.0699 7.1774 492.1008 17.9438 16.8871 191.5816 93.9741 33.0778 20.4868 41.5389 30.2966 14.6005 16.5789 7.0314 9.2705 43.6363 43.8363 11.0723 63.3951 15.8318 38.7344 6.4510 14.5935 9.1213 41.8437
temp: 298.150 k
press: 1.00000 atm
elementType: 17 8 8 7 7 6 6 6 6 6 6 6 6 6 6 6 6 6 6 1 1 1 1 1 1 1 1 1 1 1 1 1 1 1 1 1 1 1
symmnumber: 1
zpe: 812486.0 jmol-1
zpe.correction: 0.309460 hartree
zpe.thermalcorrener: 0.327820 hartree
zpe.thermalcorrenthalpy: 0.328764 hartree
zpe.thermalcorrgfe: 0.261737 hartree
zpe.sumelectzpe: -1263.463197 hartree
zpe.sumelectthermal: -1263.444836 hartree
zpe.sumelectthermalent: -1263.443892 hartree
zpe.sumelectthermalfe: -1263.510920 hartree
dipole: 0.1240 -0.9828 -0.2143
dipole: 1.0135
quadrupole: -101.6711 -118.9124 -124.2441
quadrupole: 0.1208 -5.3653 4.4965
quadrupole: 13.2714 -3.9699 -9.3016 0.1208 -5.3653 4.4965
hfenergy: -1263.7726564 hartree
pointgroup: C01 [X(C14H19Cl1N2O2)]
dipole: 0.0728905 -0.3857304 -0.0699983 debye
polarizability: 250.0299133|1.9532625|181.2496504|13.9129356|-2.8276096|116.9980312 unknown
InChI: InChI=1S/C14H19ClN2O2/c1-3-17-8-7-11(9-17)19-14(18)16-13-10(2)5-4-6-12(13)15/h4-6,11,16H,3,7-9H2,1-2H3
charge 0 multiplicity 1
38 atoms
Cl 2.491246 2.926548 -0.373569
O  -1.000543 -0.042689 -0.536343
O  0.276383 -1.193508 1.08319
N  -4.417754 0.507128 -0.515024
N  1.244971 0.190616 -0.583595
C  -2.263202 -0.533442 0.104996
C  -2.723286 0.43924 1.215311
C  -3.368727 -0.440016 -1.000662
C  -3.696767 1.386397 0.455454
C  -5.622395 -0.165181 0.053529
C  -6.531643 -0.739662 -1.048049
C  0.198428 -0.426573 0.093077
C  2.621181 0.125472 -0.221506
C  3.311675 -1.114732 -0.051042
C  3.356827 1.333881 -0.094197
C  4.684676 -1.075686 0.300449
C  2.622776 -2.442967 -0.281881
C  4.721717 1.367561 0.228741
C  5.386198 0.139733 0.445164
H  -2.065571 -1.550874 0.478863
H  -1.870283 0.949058 1.692749
H  -3.266767 -0.123158 1.99723
H  -2.894443 -0.052974 -1.920852
H  -3.808835 -1.425188 -1.229817
H  -4.410473 1.914396 1.109194
H  -3.118317 2.142656 -0.109004
H  -5.362585 -0.974832 0.781942
H  -6.185981 0.602035 0.61666
H  -6.832253 0.062381 -1.744026
H  -6.018266 -1.522957 -1.635588
H  -7.439531 -1.191855 -0.607058
H  0.961318 0.936376 -1.225727
H  5.21375 -2.025009 0.439474
H  1.979304 -2.406701 -1.180325
H  3.365764 -3.24674 -0.417097
H  1.96519 -2.699344 0.567609
H  5.244488 2.323591 0.318432
H  6.44853 0.138019 0.709398
