program: Gaussian 09
title: 000208170
version: EM64L-G09RevD.01
frameworkgroup: C1[X(C14H25N2O5PS)]
method: RPBEPBE
basis: SDD
operation: Freq
keyword: #p
keyword: freq=noraman
keyword: PBEPBE/SDD
title: #p freq=noraman PBEPBE/SDD
converged: NO YES NO NO
title: Mulliken charges:
elementType: S P O O O O O N N C C C C C C C C C C C C C C H H H H H H H H H H H H H H H H H H H H H H H H H
charge: 0.015187 1.065396 -0.205843 -0.206874 -0.652016 -0.682823 -0.590974 -0.157032 -0.292078 -0.249207 -0.221522 -0.434268 -0.439128 -0.377153 -0.401883 0.133082 0.123821 -0.375859 -0.359081 -0.379945 -0.380988 -0.277431 -0.712454 0.267431 0.264589 0.237534 0.205394 0.240269 0.203295 0.193721 0.209221 0.207929 0.213109 0.238332 0.240790 0.217933 0.216567 0.220332 0.188764 0.189019 0.214702 0.256315 0.228036 0.221087 0.290884 0.293843 0.404710 0.395265
chargesum: 0.00000
title: Mulliken charges with hydrogens summed into heavy atoms:
elementType: S P O O O O O N N C C C C C C C C C C C C C C
charge: 0.015187 1.065396 -0.205843 -0.206874 -0.247307 -0.287558 -0.590974 -0.157032 -0.035763 0.018224 0.043067 0.008660 0.004436 0.025789 0.019155 0.133082 0.123821 0.103264 0.075419 0.029150 0.022733 0.171693 -0.127726
polarizability: 2.73836193e+02 4.72806087e+00 2.04978011e+02 -5.75223151e+00 -1.39799249e+01 1.90626508e+02
1716.lowfreq: -5.9971 -0.0020 -0.0017 0.0008 0.6491 6.5562 11.3389 14.9042 19.2986
frequency: 10.4904 14.4783 18.9212 24.5683 28.1988 44.1896 52.5018 79.9369 81.5489 89.7318 109.3344 112.6641 124.0850 134.3074 139.9606 146.7362 160.6949 194.9622 201.7607 223.7489 251.5766 253.1769 270.0965 274.2373 289.2261 297.5765 322.1753 332.4434 349.6530 357.7307 361.0480 410.6911 436.2410 439.3432 442.8369 479.6841 539.5527 563.5698 591.1518 620.9997 658.4648 679.2816 687.6441 691.1493 713.6280 723.4391 748.1437 759.0301 764.4386 784.9972 801.9453 830.7818 873.1461 881.1410 907.2303 918.6715 959.7748 976.1568 991.4329 998.0015 1011.5726 1012.9406 1030.6162 1047.2962 1060.0905 1061.2494 1064.0442 1066.7740 1071.3949 1073.5666 1096.4078 1118.8636 1119.3675 1132.7699 1148.7512 1155.3122 1183.6648 1201.4731 1218.9094 1228.0754 1230.6378 1243.1831 1259.4453 1268.9525 1279.6138 1287.9234 1294.9053 1295.8032 1296.2127 1311.8554 1322.7570 1332.8773 1334.9644 1338.6713 1343.8719 1345.5489 1352.5760 1359.2621 1376.0154 1389.1042 1421.7461 1447.7746 1459.3056 1461.4546 1464.5453 1468.5569 1470.7665 1474.9077 1476.4718 1479.8648 1494.9426 1625.7196 1689.2688 2866.2604 2902.0135 2961.6354 2962.7838 2972.3677 2976.0173 2978.3337 2984.6677 2989.3639 3000.1227 3013.8231 3025.2714 3032.6476 3038.7847 3038.8456 3040.9243 3044.1970 3050.3152 3052.6053 3062.9026 3083.7394 3116.7419 3433.9031 3563.0319 3597.7636
redmass: 6.2789 5.8009 5.3635 6.2686 6.2498 4.9108 3.7902 2.5913 3.9187 2.5178 3.7621 2.4719 4.3686 2.1487 3.2776 2.5817 4.5276 3.8765 2.8449 3.1593 2.8544 2.9169 2.8053 2.7283 4.8818 5.6086 2.2282 3.1039 4.8334 2.6389 2.9288 4.6708 3.6363 11.4899 2.7754 3.9696 3.0308 3.9526 5.9512 3.8769 5.7111 8.2710 4.7019 1.3865 9.5133 2.9943 1.1844 3.2438 1.1746 1.3056 2.1392 2.1468 2.4399 2.0013 1.4576 1.8342 2.2159 2.3534 1.7181 2.1441 2.7273 1.6427 2.0410 3.4169 2.4381 2.0998 2.6544 2.0931 1.9967 2.2777 2.8430 1.2525 1.3431 1.9191 3.4519 2.2254 1.3545 1.7103 1.3837 1.5868 1.4435 1.2186 1.3765 1.3252 1.2030 1.0946 1.4733 1.3430 1.1136 1.7015 1.4024 1.8851 1.4581 1.3359 1.6464 1.4556 1.4570 1.4541 1.5442 1.4177 1.0952 1.0970 1.2110 1.0838 1.0855 1.0692 1.0840 1.0873 1.0906 1.0898 1.0887 11.7671 11.2250 1.0706 1.0701 1.0794 1.0635 1.0669 1.0616 1.0620 1.0598 1.0653 1.0851 1.0580 1.0992 1.0646 1.0838 1.0968 1.0966 1.0918 1.1035 1.1024 1.0957 1.1063 1.1074 1.0742 1.0657 1.0664
irintensity: 0.0968 0.3682 0.6032 0.0645 0.5851 0.8847 2.7996 2.6051 0.4274 1.8038 2.1573 81.3659 11.4170 2.9905 1.8198 4.4617 6.5530 6.0318 11.3084 0.2811 18.8731 4.8622 6.7037 27.0308 31.0687 14.6006 2.4020 43.7858 7.5970 49.8258 46.3804 4.6697 10.4373 137.6888 0.3964 1.0747 2.4230 11.1608 11.5001 0.1887 149.1082 135.4188 14.6297 58.0167 194.4109 2.4036 14.4137 3.9750 5.0170 0.9344 4.4758 8.6558 1.9210 7.4406 26.7146 4.1468 4.2775 7.9094 52.6253 4.0860 42.9142 85.4964 8.4311 10.1081 86.3853 9.3268 14.8113 17.9383 10.3136 12.1040 1.2220 29.2505 23.2384 56.3116 76.8558 11.3492 12.7197 11.8440 4.1281 11.6933 10.2056 6.6059 0.7646 10.3898 11.5612 0.2201 15.6009 4.3766 3.6866 2.2857 13.0924 130.5769 19.4993 22.5272 56.9048 3.7204 2.5132 4.5211 24.8701 4.8320 9.8553 19.1614 39.1870 10.6919 9.4941 2.3350 17.7334 13.5387 9.6728 2.1614 9.3563 485.3753 17.6449 91.2672 75.0290 14.0752 19.1378 14.9530 40.3259 25.8062 15.8103 35.4962 25.9607 35.7906 5.9414 8.3636 15.4271 52.3271 45.0756 5.1306 41.3998 29.4670 59.2861 14.4804 1.2072 0.0442 70.7690 82.9468
temp: 298.150 k
press: 1.00000 atm
elementType: 16 15 8 8 8 8 8 7 7 6 6 6 6 6 6 6 6 6 6 6 6 6 6 1 1 1 1 1 1 1 1 1 1 1 1 1 1 1 1 1 1 1 1 1 1 1 1 1
symmnumber: 1
zpe: 1021706.8 jmol-1
zpe.correction: 0.389148 hartree
zpe.thermalcorrener: 0.415825 hartree
zpe.thermalcorrenthalpy: 0.416769 hartree
zpe.thermalcorrgfe: 0.326379 hartree
zpe.sumelectzpe: -1771.604150 hartree
zpe.sumelectthermal: -1771.577473 hartree
zpe.sumelectthermalent: -1771.576529 hartree
zpe.sumelectthermalfe: -1771.666918 hartree
dipole: -0.9463 0.7096 0.2646
dipole: 1.2121
quadrupole: -115.2529 -160.5666 -161.1226
quadrupole: -6.9523 -12.0416 10.9483
quadrupole: 30.3945 -14.9193 -15.4752 -6.9523 -12.0416 10.9483
hfenergy: -1771.9932978 hartree
pointgroup: C01[X(C14H25N2O5P1S1)]
dipole: -0.3717917 0.2983334 0.0133846 debye
polarizability: 274.0940108|2.9825912|196.2036025|-5.4395461|-15.5587599|199.1430985 unknown
InChI: InChI=1S/C14H25N2O5PS/c17-13-11-5-1-2-6-12(11)14(18)16(13)9-4-3-7-15-8-10-23-22(19,20)21/h11-12,15,19-20H,1-10H2
charge 0 multiplicity 1
48 atoms
S  6.907108 -0.530073 1.539439
P  7.540502 0.763152 -0.208192
O  -3.700284 -2.178865 1.395048
O  -3.391434 0.566094 -2.390887
O  7.425785 2.354827 0.427823
O  9.277898 0.740653 -0.301338
O  6.794417 0.430671 -1.575422
N  -3.261949 -0.937989 -0.569845
N  3.034967 -0.955916 0.033865
C  -5.263916 -0.381325 0.589798
C  -5.357117 0.148524 -0.873288
C  -4.989432 0.742401 1.641669
C  -5.999978 1.53632 -1.088661
C  -5.873482 1.986225 1.410295
C  -5.618804 2.564069 -0.000113
C  -4.038207 -1.305238 0.559549
C  -3.915018 0.012378 -1.393892
C  -1.907554 -1.454993 -0.831246
C  -0.81611 -0.637034 -0.105244
C  0.594777 -1.195182 -0.390519
C  1.697093 -0.397736 0.333335
C  4.167055 -0.313897 0.729061
C  5.370743 -1.268604 0.682867
H  -6.162848 -0.947747 0.886422
H  -5.935801 -0.59085 -1.467298
H  -5.134653 0.320789 2.652434
H  -3.927081 1.055632 1.575222
H  -5.70772 1.902063 -2.090871
H  -7.101246 1.416083 -1.093645
H  -6.94516 1.719299 1.516711
H  -5.651232 2.743461 2.185963
H  -4.548322 2.837538 -0.095056
H  -6.200904 3.492158 -0.153048
H  -1.747141 -1.419778 -1.923822
H  -1.883782 -2.50638 -0.491688
H  -0.877999 0.418584 -0.434182
H  -1.013367 -0.659585 0.984275
H  0.661789 -2.254293 -0.07454
H  0.784676 -1.173322 -1.484718
H  1.607675 0.683719 0.059908
H  1.538695 -0.464075 1.427994
H  3.20095 -1.013978 -0.980916
H  4.455928 0.675128 0.300513
H  3.876934 -0.137815 1.781421
H  5.165628 -2.20258 1.2312
H  5.65899 -1.504635 -0.355499
H  8.131116 2.970433 0.095336
H  9.666012 -0.013008 -0.814314
