program: Gaussian 09
title: 000208163
version: EM64L-G09RevD.01
frameworkgroup: C1[X(C15H13N)]
method: RPBEPBE
basis: SDD
operation: Freq
keyword: #pfreq=noraman
keyword: PBEPBE/SDD
title: #p freq=noraman PBEPBE/SDD
converged: YES YES NO YES
title: Mulliken charges:
elementType: N C C C C C C C C C C C C C C C H H H H H H H H H H H H H
charge: -0.541938 -0.570122 0.431143 0.394800 0.375622 0.382110 -0.418656 -0.404276 -0.443632 -0.447233 -0.413033 -0.413766 -0.238801 -0.238345 -0.251124 -0.256105 0.222371 0.211719 0.212141 0.229668 0.231277 0.287191 0.269609 0.236423 0.236750 0.228591 0.228598 0.229451 0.229569
chargesum: 0.00000
title: Mulliken charges with hydrogens summed into heavy atoms:
elementType: N C C C C C C C C C C C C C C C
charge: 0.014862 -0.347751 0.431143 0.394800 0.375622 0.382110 -0.206937 -0.192135 -0.213964 -0.215957 -0.176610 -0.177016 -0.010210 -0.009747 -0.021673 -0.026536
polarizability: 2.59128910e+02 -3.84786777e-01 1.68726069e+02 -1.34679882e+00 6.11749761e+00 9.73741014e+01
1716.lowfreq: -5.1873 -0.0007 -0.0007 0.0003 7.5573 11.3337 53.5412 98.1763 132.9099
frequency: 53.5097 98.1714 132.9046 160.8241 200.5135 238.8540 265.7632 279.3540 321.3747 329.5605 384.2450 390.2763 464.5086 471.9911 523.1613 525.2333 572.7575 587.6337 604.4814 650.1116 662.1484 701.2858 709.8992 728.9890 750.0148 770.6998 771.9790 812.4528 814.0346 836.9135 880.8660 887.3601 898.0641 951.1755 954.1094 980.9590 986.7338 990.5674 1029.4122 1044.4901 1052.4269 1094.9335 1111.0627 1148.3132 1166.3127 1174.1178 1174.9071 1185.9244 1213.2614 1225.9048 1244.2109 1247.2604 1299.6547 1338.5101 1364.3560 1386.3721 1388.8078 1417.1391 1425.4009 1453.5385 1479.0633 1491.4832 1565.0333 1577.0134 1602.5116 1608.8112 1627.7681 1636.3706 3000.9238 3082.2205 3108.9890 3110.6597 3117.9856 3118.5361 3124.0504 3138.0034 3140.8802 3160.3127 3161.8740 3429.4439 3558.3873
redmass: 4.9552 3.9184 3.8922 4.3170 3.6106 1.2137 3.8093 2.7494 4.9202 4.4104 4.2690 3.3843 2.9145 4.5611 3.5177 6.1501 3.4357 3.2594 3.6416 2.7149 2.6352 4.1337 4.4010 1.6539 2.4869 1.6418 1.8113 1.5834 3.0701 3.9139 1.5652 1.6304 4.6313 1.4104 1.4078 1.3235 1.3376 1.3287 3.3212 2.3282 2.4000 2.2764 2.0499 1.6644 1.7526 1.1294 1.0880 2.2861 1.6451 2.2603 1.4658 1.4136 1.4234 1.5144 1.4133 4.4784 3.5265 1.8100 2.1416 2.1293 2.4678 2.8152 6.8125 6.3955 6.0015 5.8594 6.9781 1.1056 1.0852 1.0837 1.0938 1.0874 1.0867 1.0878 1.0889 1.0925 1.0936 1.1005 1.1007 1.0445 1.0969
irintensity: 0.7135 0.1452 0.2454 1.1822 0.2948 37.1555 3.2327 21.1523 0.9772 0.7912 0.8658 1.2460 21.1067 5.9912 8.5128 0.4060 5.6266 0.1650 34.6374 54.0321 139.1611 16.2948 23.4917 15.0674 6.6867 22.9323 61.1506 78.7731 31.7471 8.3772 3.5400 7.9468 1.9355 1.2114 5.3618 2.0364 0.0888 0.8663 8.1878 8.4926 1.7210 5.7397 0.9375 0.4675 5.2852 0.6667 0.1503 1.7955 7.8979 0.4134 4.3252 0.3159 10.4463 0.7254 4.8894 1.1448 1.6855 1.3077 11.0529 6.2108 2.4868 11.7103 0.6386 0.6700 1.0606 0.2436 0.0539 37.9329 26.1541 0.1386 22.4160 13.7211 3.6756 16.1885 1.3422 24.0128 32.1623 47.7853 30.8737 2.4472 1.2758
temp: 298.150 k
press: 1.00000 atm
elementType: 7 6 6 6 6 6 6 6 6 6 6 6 6 6 6 6 1 1 1 1 1 1 1 1 1 1 1 1 1
symmnumber: 1
zpe: 618290.6 jmol-1
zpe.correction: 0.235494 hartree
zpe.thermalcorrener: 0.247835 hartree
zpe.thermalcorrenthalpy: 0.248779 hartree
zpe.thermalcorrgfe: 0.197365 hartree
zpe.sumelectzpe: -633.038892 hartree
zpe.sumelectthermal: -633.026552 hartree
zpe.sumelectthermalent: -633.025608 hartree
zpe.sumelectthermalfe: -633.077022 hartree
dipole: 0.9077 0.5033 -0.3057
dipole: 1.0820
quadrupole: -83.6052 -81.5991 -98.9758
quadrupole: -1.6217 3.8870 2.9022
quadrupole: 4.4548 6.4609 -10.9158 -1.6217 3.8870 2.9022
hfenergy: -633.2743869 hartree
pointgroup: C01 [X(C15H13N1)]
dipole: 0.3565206 -0.1997189 0.1192037 debye
polarizability: 259.1162147|0.2810916|168.5623062|1.9904642|7.003859|97.5505599 unknown
InChI: InChI=1S/C15H13N/c16-15-13-7-3-1-5-11(13)9-10-12-6-2-4-8-14(12)15/h1-10,15H,16H2
charge 0 multiplicity 1
29 atoms
N  -0.033677 0.758584 -2.29955
C  0.012875 1.064494 -0.843348
C  -1.275861 0.580704 -0.183969
C  1.292864 0.569651 -0.15012
C  -1.597988 -0.811884 -0.091534
C  1.627172 -0.822434 -0.068255
C  -0.67238 -1.903217 -0.425585
C  0.704023 -1.909684 -0.412225
C  -2.220885 1.535931 0.259217
C  2.233552 1.527784 0.302141
C  -2.894233 -1.181719 0.379981
C  2.925368 -1.186599 0.399786
C  -3.483219 1.15263 0.759803
C  3.501005 1.149583 0.795635
C  -3.82663 -0.2195 0.806933
C  3.853928 -0.220666 0.830601
H  0.017959 2.167967 -0.762697
H  -1.157655 -2.872974 -0.607431
H  1.184677 -2.883115 -0.586877
H  -1.970387 2.600647 0.182162
H  1.971196 2.59218 0.246686
H  -0.177489 -0.239461 -2.493623
H  0.783696 1.12329 -2.803738
H  -3.15036 -2.247054 0.432581
H  3.188167 -2.250772 0.447481
H  -4.199271 1.9140 1.087921
H  4.211219 1.912595 1.133041
H  -4.810046 -0.531437 1.175274
H  4.840079 -0.528927 1.194604
