program: Gaussian 09
title: 000208157
version: EM64L-G09RevD.01
frameworkgroup: C1[X(C10H19N2O5PS)]
method: RPBEPBE
basis: SDD
operation: Freq
keyword: #p
keyword: freq=noraman
keyword: PBEPBE/SDD
title: #p freq=noraman PBEPBE/SDD
converged: YES YES NO NO
title: Mulliken charges:
elementType: S P O O O O O N N C C C C C C C C C C H H H H H H H H H H H H H H H H H H H
charge: 0.024016 1.072683 -0.230849 -0.231496 -0.678480 -0.656452 -0.588975 -0.190297 -0.308331 -0.344146 -0.426540 -0.413497 -0.490726 -0.491211 0.197631 0.198134 -0.368656 -0.266246 -0.713990 0.236048 0.272176 0.226150 0.233827 0.228550 0.226241 0.261898 0.235306 0.235432 0.261429 0.198295 0.212772 0.268501 0.199863 0.219898 0.293483 0.300369 0.392553 0.404639
chargesum: 0.00000
title: Mulliken charges with hydrogens summed into heavy atoms:
elementType: S P O O O O O N N C C C C C C C C C C
charge: 0.024016 1.072683 -0.230849 -0.231496 -0.285928 -0.251813 -0.588975 -0.190297 -0.039830 0.164078 0.033438 0.041293 0.006478 0.005650 0.197631 0.198134 0.042411 0.153515 -0.120139
polarizability: 2.42330865e+02 -6.67899511e+00 1.64271326e+02 4.95824322e+00 -5.23907088e+00 1.44093166e+02
1716.lowfreq: -4.0572 -0.0015 -0.0012 0.0012 4.6430 7.4033 14.0341 17.0276 20.9159
frequency: 13.8069 16.8744 20.8400 26.7175 37.5507 53.9218 67.4791 87.3871 100.8603 118.3113 134.9771 140.1620 143.4462 171.2800 191.7334 214.2986 236.9977 254.1292 267.7354 285.3120 308.7354 321.6286 334.5281 352.9802 355.8668 363.6442 421.0873 438.8470 439.8382 454.7635 525.6838 543.2344 552.4023 595.8198 646.2423 658.2208 673.1466 685.6628 712.9064 715.7768 764.0446 771.2312 855.2811 861.7668 900.8880 905.1565 921.4698 963.6352 986.6056 1014.2062 1021.4081 1041.5785 1058.5978 1060.0840 1063.3666 1069.3685 1083.8303 1095.8428 1121.4488 1134.0237 1149.6834 1158.8350 1192.0298 1224.1648 1233.2260 1246.8715 1260.1118 1282.6968 1289.1088 1305.9192 1321.0406 1322.2425 1326.1367 1333.3672 1340.1254 1352.5622 1376.3089 1383.0418 1423.5659 1441.4660 1446.7799 1451.6338 1457.9042 1474.0791 1475.8632 1479.2868 1489.1125 1585.6024 1629.0673 2867.4422 2875.7142 2984.4149 2986.1551 2988.6941 3001.8614 3005.9072 3026.7209 3035.0754 3049.2792 3054.8589 3066.1364 3076.8867 3080.9701 3115.2530 3122.6376 3437.3947 3563.5643 3597.2066
redmass: 6.8524 6.2888 6.8091 6.8479 6.0171 3.9989 4.7331 2.7902 3.3570 3.6791 3.4264 2.8260 4.6715 3.7415 2.6949 2.1155 2.0664 2.3995 1.8374 7.1415 4.7569 3.2701 3.5274 2.7387 3.8241 2.4112 5.5565 4.7746 11.8361 4.3127 2.8204 4.2472 2.9610 3.4822 5.2060 3.3548 3.1772 2.3357 11.4215 3.0321 1.1680 1.2440 1.6242 1.9033 2.1253 2.2778 2.4771 2.1930 1.6168 1.3943 1.4592 3.5540 2.4720 2.0788 2.3842 1.8577 3.5206 2.9534 1.7032 1.3337 3.7514 1.6320 1.5991 1.3417 1.2618 1.2707 1.3092 1.4749 1.1153 2.3211 1.3918 1.5243 1.6967 1.3843 1.3877 1.6076 1.4664 1.3709 1.0920 1.0788 1.1018 1.0955 1.1472 1.1013 1.1094 1.0864 1.0807 11.1281 9.6358 1.0708 1.0705 1.0680 1.0671 1.0690 1.0798 1.0611 1.0869 1.0595 1.0643 1.0959 1.1001 1.0936 1.0968 1.1074 1.1053 1.0744 1.0657 1.0664
irintensity: 0.1320 0.5706 1.8067 0.5148 0.9195 2.4377 5.7784 0.4269 3.7800 23.8883 36.9963 4.4221 5.6289 12.7711 22.3567 16.5071 3.0444 32.8121 29.0764 3.5756 16.7202 38.7298 22.6805 11.2659 7.0943 94.1598 14.7535 2.8242 158.0630 0.1265 2.6214 10.5480 11.1355 8.9349 2.9162 159.5158 52.5764 142.1772 179.1485 7.8924 4.6981 11.9654 0.1264 4.5767 5.5621 3.0455 10.4517 22.1306 59.2680 132.6469 7.3815 2.8225 18.7556 4.0110 83.3485 37.6845 0.6547 1.9240 16.4355 80.0151 98.1434 50.7288 11.2150 16.4024 20.7647 7.2242 32.0955 27.0282 11.5731 88.6373 15.3838 54.1501 27.8090 3.4630 55.0738 52.8863 12.5803 8.6400 10.4147 5.3591 6.7021 23.8757 65.1336 14.7115 3.8247 15.5991 7.5164 389.0304 51.2376 53.9716 165.0578 8.5189 6.8459 8.6117 39.9803 38.0835 17.9238 8.9617 14.0276 21.7318 33.8784 11.5303 13.0306 1.0115 2.5161 0.1554 81.3068 56.8265
temp: 298.150 k
press: 1.00000 atm
elementType: 16 15 8 8 8 8 8 7 7 6 6 6 6 6 6 6 6 6 6 1 1 1 1 1 1 1 1 1 1 1 1 1 1 1 1 1 1 1
symmnumber: 1
zpe: 782158.4 jmol-1
zpe.correction: 0.297908 hartree
zpe.thermalcorrener: 0.320558 hartree
zpe.thermalcorrenthalpy: 0.321503 hartree
zpe.thermalcorrgfe: 0.241032 hartree
zpe.sumelectzpe: -1615.878155 hartree
zpe.sumelectthermal: -1615.855505 hartree
zpe.sumelectthermalent: -1615.854561 hartree
zpe.sumelectthermalfe: -1615.935031 hartree
dipole: 3.3837 -0.9790 -2.0552
dipole: 4.0782
quadrupole: -101.5343 -141.6563 -126.6986
quadrupole: 20.3304 8.2116 4.8148
quadrupole: 21.7621 -18.3599 -3.4022 20.3304 8.2116 4.8148
hfenergy: -1616.1760634 hartree
pointgroup: C01 [X(C10H19N2O5P1S1)]
dipole: -1.2955282 -0.4715446 0.8207787 debye
polarizability: 242.4189329|7.533907|163.3957871|1.8157345|6.7009204|144.880637 unknown
InChI: InChI=1S/C10H19N2O5PS/c13-9-3-1-4-10(14)12(9)7-2-5-11-6-8-19-18(15,16)17/h11,15-16H,1-8H2
charge 0 multiplicity 1
38 atoms
S  4.811216 -0.205477 -1.816109
P  5.84984 0.512027 0.064311
O  -2.335574 2.031626 0.302884
O  -4.170318 -2.206653 -0.307576
O  6.769607 -0.783776 0.781827
O  7.20878 1.314054 -0.611917
O  4.90502 1.282868 1.088308
N  -3.274952 -0.063286 -0.101302
N  1.06118 -0.476781 0.008195
C  -1.914145 -0.60643 -0.381847
C  -1.19077 -1.043253 0.909872
C  -5.879454 1.079486 -0.209149
C  -4.767375 1.877417 0.495525
C  -5.756651 -0.408298 0.166934
C  -3.373649 1.318572 0.228402
C  -4.366887 -0.977625 -0.101294
C  0.239078 -1.543322 0.622964
C  2.444062 -0.852789 -0.328922
C  3.040848 0.218191 -1.254872
H  -2.038619 -1.470496 -1.054802
H  -1.329562 0.177553 -0.886358
H  -1.148911 -0.187644 1.612176
H  -1.761348 -1.853775 1.400357
H  -6.87154 1.466522 0.08393
H  -5.793302 1.199692 -1.30555
H  -4.749242 2.936885 0.189585
H  -4.928577 1.868216 1.593042
H  -5.97417 -0.547985 1.245677
H  -6.471901 -1.042948 -0.382653
H  0.679395 -1.93396 1.573823
H  0.200857 -2.396491 -0.083882
H  1.018046 0.397882 0.550146
H  3.103376 -0.976986 0.566166
H  2.422086 -1.825935 -0.854986
H  2.466692 0.300138 -2.192499
H  3.082816 1.204331 -0.762365
H  6.2752 -1.337984 1.437699
H  8.037349 1.217635 -0.07234
