program: Gaussian 09
title: 000208152
version: EM64L-G09RevD.01
frameworkgroup: C1[X(C18H19NO2S)]
method: RPBEPBE
basis: SDD
operation: Freq
keyword: #p
keyword: freq=noraman
keyword: PBEPBE/SDD
title: #p freq=noraman PBEPBE/SDD
converged: YES YES NO NO
title: Mulliken charges:
elementType: S O O N C C C C C C C C C C C C C C C C C C H H H H H H H H H H H H H H H H H H H
charge: 0.216539 -0.262203 -0.262512 -0.079393 -0.420752 -0.330044 -0.297807 0.431346 -0.362835 0.350713 0.374051 -0.481886 0.059581 -0.308584 -0.264277 -0.375460 -0.625189 -0.614809 -0.339664 -0.293501 -0.246145 -0.220954 0.234019 0.222878 0.172495 0.206334 0.212931 0.209199 0.304484 0.246125 0.260725 0.236674 0.185453 0.221072 0.223339 0.187153 0.225754 0.286014 0.246059 0.236982 0.236093
chargesum: 0.00000
title: Mulliken charges with hydrogens summed into heavy atoms:
elementType: S O O N C C C C C C C C C C C C C C C C C C
charge: 0.216539 -0.262203 -0.262512 -0.079393 0.036145 0.048784 0.124324 0.431346 -0.362835 0.350713 0.374051 -0.177402 0.059581 -0.308584 -0.018152 -0.114735 0.018009 0.021437 -0.053650 -0.047442 -0.009163 0.015139
polarizability: 3.65258370e+02 -2.58374502e+01 2.46832277e+02 1.94723591e+00 -9.97615844e-01 1.11088300e+02
1716.lowfreq: -3.8644 -0.0016 -0.0015 -0.0012 4.6408 7.7021 16.6043 30.1917 37.8587
frequency: 16.5980 29.6214 37.8305 40.4725 69.5880 106.1484 109.7909 122.0577 132.0045 156.9715 168.5703 170.9935 213.7512 217.9590 224.0643 250.0478 286.3545 322.5624 326.2652 334.7385 350.3579 399.6282 408.6827 418.7435 432.6583 448.1826 458.6123 467.1942 493.2577 516.6517 558.4250 574.6230 625.7284 666.0553 681.0256 683.7941 721.9245 728.6460 756.7047 778.8462 805.0361 807.5175 824.9443 833.4680 880.0226 883.6112 920.9079 954.7493 960.6482 975.6082 988.7070 1007.9909 1025.8885 1028.3454 1033.6086 1048.8471 1059.8823 1070.6258 1085.5483 1093.8428 1100.5833 1113.1251 1125.0589 1142.0965 1156.0175 1173.8460 1174.0643 1212.3109 1222.3006 1235.0970 1260.9069 1266.3214 1278.0202 1288.1329 1296.1844 1303.5102 1375.1986 1385.8489 1386.8672 1396.3690 1405.8993 1420.4810 1424.6679 1443.4966 1453.9252 1461.0341 1461.8484 1463.5974 1474.9335 1476.1380 1479.6054 1485.0276 1491.8685 1522.0688 1559.5538 1577.9160 1602.0065 1610.5985 2814.0612 2844.1110 2860.7256 2952.8719 2999.9200 3011.1615 3013.3375 3019.2064 3032.0425 3077.3581 3080.3924 3089.3220 3132.6822 3139.7662 3144.5488 3157.5156 3163.4547 3170.9256 3172.2973
redmass: 4.2896 3.0743 4.9287 6.6349 3.8088 3.4025 2.0600 3.2862 3.9924 2.8335 7.0464 5.5020 1.1779 5.4099 2.0435 1.5549 4.3933 5.4626 6.5066 2.7502 3.7680 5.0475 3.6621 6.8567 4.8944 3.1677 4.8249 4.0253 3.8855 4.0214 4.0204 6.6954 7.2583 6.8940 4.1704 7.3145 3.9697 7.4268 1.4887 1.1237 2.8269 4.5802 1.4351 6.5295 1.2412 1.4097 1.4983 7.2087 1.3430 1.3708 4.1462 1.3442 2.5027 3.3629 1.5561 5.8513 2.5981 2.5654 2.4445 1.3940 1.5483 1.8156 1.9586 1.5089 1.4943 1.1375 1.3478 3.5827 1.7895 1.6284 2.2512 1.5496 1.2316 2.0202 1.3206 1.4037 1.3433 7.6764 1.5650 5.0190 6.2797 1.1449 2.4285 1.1642 2.3703 2.1795 1.0628 1.0656 1.1040 1.0814 1.0854 1.0729 1.1012 10.4928 7.4423 8.1450 6.1864 6.4583 1.0706 1.0574 1.0574 1.0554 1.0843 1.0953 1.0720 1.0722 1.0716 1.1019 1.1035 1.1005 1.0862 1.0894 1.0898 1.0943 1.0904 1.1005 1.0961
irintensity: 0.5383 1.8329 0.4388 1.4950 0.1834 0.2443 0.5332 0.5552 1.3385 4.7404 0.5769 1.8880 2.6685 0.4085 0.1406 0.3566 8.0317 6.4831 1.8481 7.2916 0.8311 0.0893 1.0001 0.0394 2.1990 0.1515 7.8724 2.6713 9.0349 3.2760 14.6115 10.7073 17.2940 5.9092 2.4357 21.1896 0.5225 3.8933 91.8772 1.4643 2.6794 18.2719 40.4808 24.9714 2.2460 0.5021 18.6287 61.4212 0.0072 2.1512 94.3557 0.9545 3.5241 27.0257 16.4191 5.3302 3.2807 5.5021 22.9587 7.5292 8.4799 15.3778 16.5651 5.6566 50.6534 1.6859 5.5917 140.6936 6.9056 0.4815 11.9692 40.7716 1.5180 158.6380 42.0788 26.5984 10.0493 9.6123 68.5675 125.1512 25.5670 2.8226 94.8275 3.5133 57.7536 136.5726 4.8486 20.0507 2.6368 4.3222 15.2046 13.6131 11.8990 194.9288 9.0821 36.4585 8.7606 81.8208 81.5220 72.5012 217.7586 22.1198 17.6326 17.6777 30.3864 46.1401 46.6642 17.4534 60.7006 46.3893 0.8555 4.6076 8.5609 5.6655 15.5063 32.5355 5.8905
temp: 298.150 k
press: 1.00000 atm
elementType: 16 8 8 7 6 6 6 6 6 6 6 6 6 6 6 6 6 6 6 6 6 6 1 1 1 1 1 1 1 1 1 1 1 1 1 1 1 1 1 1 1
symmnumber: 1
zpe: 857591.8 jmol-1
zpe.correction: 0.326639 hartree
zpe.thermalcorrener: 0.347408 hartree
zpe.thermalcorrenthalpy: 0.348352 hartree
zpe.thermalcorrgfe: 0.274953 hartree
zpe.sumelectzpe: -1298.966037 hartree
zpe.sumelectthermal: -1298.945268 hartree
zpe.sumelectthermalent: -1298.944324 hartree
zpe.sumelectthermalfe: -1299.017724 hartree
dipole: 0.2647 0.5296 0.6818
dipole: 0.9030
quadrupole: -105.3597 -132.5353 -142.8367
quadrupole: 4.1424 -4.9155 0.8331
quadrupole: 21.5509 -5.6248 -15.9261 4.1424 -4.9155 0.8331
hfenergy: -1299.2926764 hartree
pointgroup: C01 [X(C18H19N1O2S1)]
dipole: -0.1048706 0.2017497 -0.2729644 debye
polarizability: 366.9798535|20.7097751|244.7475848|-7.6955691|-5.0949337|111.4515089 unknown
InChI: InChI=1S/C18H19NO2S/c1-19(2)10-5-11-21-13-8-9-17-15(12-13)18(20)14-6-3-4-7-16(14)22-17/h3-4,6-9,12H,5,10-11H2,1-2H3
charge 0 multiplicity 1
41 atoms
S  -3.570087 2.011992 0.039449
O  2.42473 1.3509 -0.091688
O  -1.401969 -2.014894 0.056299
N  6.846025 -0.834885 -0.003312
C  4.591168 0.285922 -0.10636
C  5.385694 -1.037122 -0.149575
C  3.084198 0.028039 -0.063854
C  -1.219406 0.377464 0.012356
C  -1.786047 1.678896 0.002626
C  1.027641 1.378487 -0.057788
C  -3.499443 -0.846478 0.083416
C  0.199239 0.244682 -0.017648
C  -2.008407 -0.889706 0.051021
C  -4.279748 0.343341 0.081959
C  -0.944613 2.823877 -0.037258
C  0.446995 2.679149 -0.067354
C  7.44927 -0.092704 -1.129493
C  7.551195 -2.108837 0.249831
C  -4.186079 -2.096782 0.118307
C  -5.697684 0.282417 0.115002
C  -5.585648 -2.163863 0.150719
C  -6.346333 -0.964054 0.149119
H  4.897192 0.858483 0.787668
H  4.81016 0.909142 -0.992401
H  5.137435 -1.589584 -1.096718
H  5.057414 -1.680945 0.690731
H  2.789675 -0.508126 0.861899
H  2.750256 -0.567349 -0.939355
H  0.585402 -0.77855 -0.00777
H  -1.385621 3.826483 -0.044186
H  1.10721 3.550911 -0.097759
H  7.01417 0.917861 -1.204114
H  7.31304 -0.605431 -2.116896
H  8.533052 0.022606 -0.951185
H  8.62092 -1.908694 0.439496
H  7.482635 -2.835445 -0.600363
H  7.131184 -2.594766 1.148706
H  -3.564943 -2.998267 0.118571
H  -6.28326 1.208392 0.113724
H  -6.090917 -3.134657 0.177239
H  -7.440693 -1.003507 0.174341
