program: Gaussian 09
title: 000208150
version: EM64L-G09RevD.01
frameworkgroup: C1[X(C17H17NO2S)]
method: RPBEPBE
basis: SDD
operation: Freq
keyword: #p
keyword: freq=noraman
keyword: PBEPBE/SDD
title: #p freq=noraman PBEPBE/SDD
converged: YES YES NO NO
title: Mulliken charges:
elementType: S O O N C C C C C C C C C C C C C C C C C H H H H H H H H H H H H H H H H H
charge: 0.210095 -0.261987 -0.252269 -0.097010 0.431843 -0.345436 -0.383733 0.371012 -0.284075 0.368061 0.059511 -0.510667 -0.305748 -0.284659 -0.354823 -0.333669 -0.294935 -0.614959 -0.614007 -0.247079 -0.220849 0.207970 0.227070 0.224066 0.207073 0.305586 0.242387 0.259955 0.286267 0.245521 0.192478 0.229595 0.222908 0.227835 0.218560 0.195473 0.236964 0.235675
chargesum: 0.00000
title: Mulliken charges with hydrogens summed into heavy atoms:
elementType: S O O N C C C C C C C C C C C C C C C C C
charge: 0.210095 -0.261987 -0.252269 -0.097010 0.431843 -0.345436 0.051307 0.371012 0.147064 0.368061 0.059511 -0.205082 -0.305748 -0.042272 -0.094868 -0.047403 -0.049414 0.030022 0.027862 -0.010115 0.014826
polarizability: 3.74293356e+02 1.03549293e+01 2.15403382e+02 -3.82551960e+00 -2.64531746e+00 1.05188552e+02
1716.lowfreq: -14.1604 -0.0017 0.0011 0.0012 3.1018 6.2147 14.2680 22.9347 40.1516
frequency: 9.1609 21.9624 40.1252 47.6421 81.3009 102.8273 120.1045 134.9137 154.5839 176.1025 182.6709 210.9238 218.5796 219.4506 253.6470 304.2737 324.3518 332.2904 353.0392 385.2215 409.1354 410.1774 418.2620 441.8188 447.1607 467.4112 492.9283 502.2339 557.0510 596.9044 625.0217 651.9924 678.7960 680.6061 721.0259 728.3015 757.1895 802.9206 805.7166 809.6830 825.6300 843.1010 883.7686 935.2004 943.2949 951.0835 975.6361 995.1405 1008.7532 1028.5141 1033.7887 1036.3339 1051.5155 1059.9282 1060.3068 1088.5601 1093.2867 1118.5283 1125.4918 1138.1397 1163.8910 1167.3292 1173.8251 1214.3524 1235.7560 1249.2198 1263.8206 1269.7464 1290.8608 1293.3790 1330.3793 1379.8100 1386.1136 1398.1010 1410.4805 1421.0023 1425.2410 1441.7204 1453.1499 1459.3144 1460.9746 1468.6781 1472.5539 1475.4690 1484.2395 1486.4607 1527.1642 1554.1364 1575.4315 1603.0129 1617.6043 2857.8759 2867.2332 2900.9308 2966.9233 3021.1102 3025.9677 3031.7966 3059.6871 3079.7629 3083.4853 3132.0119 3136.9619 3144.2239 3156.8701 3168.8338 3169.7583 3170.6689
redmass: 3.3334 3.6791 6.6164 4.3185 3.6954 4.0606 2.5248 4.8451 4.0825 6.3625 3.2057 1.1563 4.6405 1.5208 2.3559 4.9710 6.6144 5.8295 2.9075 4.8607 3.5834 3.0692 7.0156 4.9004 3.1554 5.9981 3.8795 4.9042 3.9865 5.9839 7.2623 7.1918 7.9125 4.1040 4.0407 7.5490 1.4875 2.2964 2.9232 1.9166 1.3961 3.8247 1.4208 1.4675 6.9809 1.3820 1.3721 4.1346 1.3440 3.4058 2.2359 1.5328 5.3381 1.9403 2.0788 1.4263 2.1937 1.8130 2.1299 1.4399 1.3974 1.5120 1.0717 3.3798 1.5735 1.7910 1.6009 2.5163 2.5558 1.2283 1.3664 2.3123 8.6366 2.5042 3.9275 1.1543 2.4542 1.1605 2.3967 1.5439 1.3429 1.0641 1.1327 1.0585 1.0993 1.0551 10.0665 6.9430 7.6887 6.1889 6.8645 1.0563 1.0570 1.0693 1.0564 1.0736 1.0743 1.0999 1.0970 1.1007 1.1007 1.0862 1.0893 1.0898 1.0943 1.0941 1.0924 1.1003
irintensity: 0.0641 2.0693 1.9073 0.8448 0.5172 1.8244 0.6248 0.2238 0.1944 1.7189 0.6962 1.1752 1.2642 0.8245 2.7896 7.6157 1.6238 6.7003 14.3708 1.8434 1.8355 3.8341 0.5717 0.4707 0.0066 6.4695 9.8647 2.8484 14.4256 11.3222 12.9322 9.1687 11.1294 2.5169 0.3042 5.3799 91.6193 25.8135 4.8021 22.7261 6.3623 10.8803 0.0993 9.7935 84.3066 10.7445 2.6050 99.1238 1.0410 26.5095 67.0178 15.8282 20.7057 3.9559 1.9776 16.8685 9.6448 4.2843 34.2870 3.2336 5.1715 25.6403 2.0640 143.3445 0.9672 7.0229 72.7959 24.9024 310.3174 4.0269 8.1812 28.0342 9.2417 7.6047 47.2334 6.3622 122.4549 5.7001 86.8664 51.4343 67.3389 4.2761 14.2652 13.1568 16.4864 10.3887 197.1390 35.7966 49.1867 20.7406 55.1998 69.4187 187.1892 87.6280 40.5706 37.6901 51.1820 15.2718 32.5794 32.7563 62.4461 0.9999 5.7356 8.7419 5.6916 5.4185 23.9604 25.6849
temp: 298.150 k
press: 1.00000 atm
elementType: 16 8 8 7 6 6 6 6 6 6 6 6 6 6 6 6 6 6 6 6 6 1 1 1 1 1 1 1 1 1 1 1 1 1 1 1 1 1
symmnumber: 1
zpe: 783559.0 jmol-1
zpe.correction: 0.298442 hartree
zpe.thermalcorrener: 0.317987 hartree
zpe.thermalcorrenthalpy: 0.318931 hartree
zpe.thermalcorrgfe: 0.247713 hartree
zpe.sumelectzpe: -1259.740088 hartree
zpe.sumelectthermal: -1259.720542 hartree
zpe.sumelectthermalent: -1259.719598 hartree
zpe.sumelectthermalfe: -1259.790816 hartree
dipole: 1.6116 3.0383 0.2557
dipole: 3.4487
quadrupole: -89.6749 -132.3163 -134.6362
quadrupole: -2.8249 1.8258 1.0576
quadrupole: 29.2009 -13.4405 -15.7604 -2.8249 1.8258 1.0576
hfenergy: -1260.0385294 hartree
pointgroup: C01 [X(C17H17N1O2S1)]
dipole: -0.6558594 -1.1870655 -0.0416216 debye
polarizability: 374.6938235|7.2052099|212.651643|0.9698441|16.2753006|107.5398233 unknown
InChI: InChI=1S/C17H17NO2S/c1-18(2)9-10-20-12-7-8-16-14(11-12)17(19)13-5-3-4-6-15(13)21-16/h3-8,11H,9-10H2,1-2H3
charge 0 multiplicity 1
38 atoms
S  2.605501 -2.129365 -0.424497
O  -2.799298 0.537823 0.017232
O  1.806416 2.31244 0.330938
N  -6.490837 -0.009206 -0.032255
C  0.879493 0.129641 -0.045251
C  1.011316 -1.268391 -0.284743
C  -5.201886 0.718811 0.018872
C  3.431423 0.570439 0.039504
C  -4.030387 -0.263438 -0.120755
C  -1.570217 -0.121044 -0.095287
C  2.027717 1.073316 0.120033
C  -0.423865 0.68158 0.045649
C  3.800268 -0.784468 -0.188907
C  -0.141732 -2.076144 -0.428463
C  -1.428432 -1.516743 -0.336538
C  4.474912 1.529054 0.206704
C  5.166732 -1.165011 -0.246426
C  -7.589488 0.783727 -0.619477
C  -6.874009 -0.606559 1.263814
C  5.825973 1.160039 0.150807
C  6.17313 -0.198323 -0.077338
H  -5.073781 1.311121 0.956526
H  -5.156779 1.432777 -0.822455
H  -4.065845 -0.754483 -1.112571
H  -4.059273 -1.041862 0.668434
H  -0.516678 1.755807 0.230048
H  -0.035014 -3.150611 -0.613954
H  -2.301278 -2.16488 -0.453844
H  4.166432 2.564948 0.380923
H  5.43349 -2.212856 -0.423085
H  -7.878954 1.672872 -0.00428
H  -7.299878 1.140211 -1.623494
H  -8.484776 0.145541 -0.731497
H  -7.762499 -1.248823 1.128141
H  -6.059069 -1.241115 1.653372
H  -7.114891 0.159418 2.043856
H  6.609505 1.913212 0.282144
H  7.225258 -0.499752 -0.122982
