program: Gaussian 09
title: 000208146
version: EM64L-G09RevD.01
frameworkgroup: C1[X(C19H21N3S)]
method: RPBEPBE
basis: SDD
operation: Freq
keyword: #p
keyword: freq=noraman
keyword: PBEPBE/SDD
title: #p freq=noraman PBEPBE/SDD
converged: NO YES NO NO
title: Mulliken charges:
elementType: S N N N C C C C C C C C C C C C C C C C C C C H H H H H H H H H H H H H H H H H H H H H
charge: 0.232104 -0.208017 -0.059914 -0.709632 -0.378799 -0.399892 -0.381932 -0.389523 0.360193 0.417180 -0.614701 -0.478615 -0.479744 0.486173 -0.588149 -0.367573 -0.195484 0.525773 -0.409439 -0.447097 -0.252220 -0.250993 -0.242465 0.239929 0.228526 0.211341 0.219972 0.212461 0.180209 0.181071 0.211656 0.225007 0.224348 0.185680 0.232947 0.261986 0.247566 0.234001 0.221085 0.250379 0.224599 0.227603 0.306608 0.305794
chargesum: 0.00000
title: Mulliken charges with hydrogens summed into heavy atoms:
elementType: S N N N C C C C C C C C C C C C C C C C C C C
charge: 0.232104 -0.208017 -0.059914 -0.097230 0.089655 0.031420 0.010738 0.003203 0.360193 0.417180 0.020334 -0.245669 -0.479744 0.486173 -0.326163 -0.367573 0.052082 0.525773 -0.175438 -0.226012 -0.001841 -0.026394 -0.014862
polarizability: 3.36165751e+02 -3.48956610e+01 2.72180803e+02 9.80075457e+00 1.38432356e+01 1.70093783e+02
1716.lowfreq: -9.5180 -6.1364 -5.3621 -0.0017 -0.0013 -0.0010 30.0041 40.7265 59.8214
frequency: 29.9709 40.6916 59.8147 67.3302 86.2554 111.9457 131.2722 157.4944 184.2736 206.7454 215.1679 231.5705 255.7752 280.6360 287.6309 294.3959 315.6149 325.0228 342.4623 354.7780 362.8387 369.6499 386.6638 394.8957 408.3230 428.4631 450.5956 477.6102 482.5249 496.8154 527.3468 562.6417 576.5060 590.8632 635.7600 650.9478 671.4199 674.6930 700.4157 738.0926 740.0719 754.9207 756.9232 807.5798 815.7430 822.3232 850.0537 864.1511 886.6220 895.8954 936.1840 938.9280 943.6490 947.5652 981.2297 1004.1063 1013.8438 1027.6392 1032.2041 1044.5447 1047.4311 1053.9075 1071.6108 1078.4848 1115.1839 1123.2572 1131.1335 1146.7419 1149.1249 1159.2540 1168.5921 1196.2414 1213.3717 1225.1133 1239.1061 1250.1785 1253.7298 1286.9783 1290.7883 1311.7007 1339.3943 1340.9129 1351.9049 1362.4851 1368.6060 1373.5909 1379.0398 1392.7735 1415.2248 1430.5246 1431.1765 1454.3691 1455.5164 1460.8383 1462.0829 1465.2855 1473.4594 1478.3686 1480.1529 1558.0831 1572.8620 1593.1309 1606.3887 1617.5027 1641.8923 2831.8698 2839.2048 2861.6263 2911.8470 2932.2410 3018.9672 3026.4105 3032.0258 3045.2442 3077.1039 3082.3576 3114.7675 3118.3677 3123.5790 3127.1752 3132.3232 3145.9994 3154.2724 3163.3381 3568.1502 3708.8709
redmass: 4.6129 4.8880 3.8185 3.3379 3.8990 4.4071 3.8860 4.4080 5.2851 2.7293 3.1263 1.2730 4.5783 3.5749 3.2660 3.1244 3.8407 2.6018 3.0023 1.4763 2.8040 1.0481 3.8363 3.6181 3.2990 3.9067 3.5705 3.2649 3.2339 4.0220 3.7048 3.9498 4.8563 3.4645 5.5441 4.2518 4.1262 4.2020 4.8107 3.6170 3.4409 2.5784 1.5549 2.6661 1.4835 2.0555 1.6370 1.7918 2.5753 1.6551 2.1954 2.5886 1.4317 1.4239 1.3292 2.6548 4.0231 3.5685 1.9969 2.2940 1.7790 1.9567 1.6428 1.7608 1.7197 1.6732 1.9377 1.6412 2.3201 2.4725 1.0640 1.1214 1.7298 2.0693 1.7508 1.9146 1.4664 1.6037 1.4653 2.3582 1.7133 1.3074 1.5115 2.7855 2.0886 1.5148 2.5967 3.2645 2.3300 1.4983 1.8365 1.0791 1.0933 1.1021 2.3775 1.1147 1.1167 3.2411 1.0584 6.2029 7.3187 6.5209 6.5511 5.0527 1.2291 1.0711 1.0669 1.0592 1.0680 1.0702 1.0728 1.0879 1.0895 1.0913 1.1010 1.0909 1.0864 1.0858 1.0885 1.0902 1.0884 1.0940 1.0959 1.1005 1.0448 1.1040
irintensity: 0.3115 0.8580 0.2630 1.1246 0.2846 0.4731 3.0777 3.5262 2.7605 3.0004 0.8993 0.5270 8.8884 0.8255 0.8195 3.6559 13.6289 4.7619 29.2741 245.1208 2.5927 11.1247 1.1336 0.6076 1.7101 0.7836 4.6724 8.7433 4.7843 6.6632 0.3141 6.5078 3.1371 0.8100 0.7624 11.4604 6.8428 3.9332 2.8583 4.2792 4.1029 34.6389 29.5438 13.8866 41.4006 26.8156 2.2919 2.0452 16.7503 35.4494 4.4132 12.9195 2.3726 2.7510 0.0361 91.9397 6.6001 11.3746 9.5488 1.2019 0.7232 3.7185 10.2843 1.5534 18.9011 13.8614 0.5324 22.2074 54.0739 11.9817 0.4706 15.5691 100.9875 52.4647 13.3604 0.5079 13.4216 33.6118 20.0248 41.0591 7.9707 1.5640 8.1954 17.1441 38.3397 11.1272 30.6471 7.7817 9.6244 10.7192 28.4577 0.1600 4.7899 56.0708 25.8069 26.8366 7.6076 81.5216 10.3245 23.7414 18.4140 25.2621 193.9163 63.1961 239.9373 55.0624 57.5729 207.9384 55.7111 75.8978 49.1626 48.8087 56.6433 23.6940 30.7382 14.4555 5.4253 19.3988 13.1006 18.4287 7.8579 24.1880 15.9074 39.2681 74.1310 19.5811
temp: 298.150 k
press: 1.00000 atm
elementType: 16 7 7 7 6 6 6 6 6 6 6 6 6 6 6 6 6 6 6 6 6 6 6 1 1 1 1 1 1 1 1 1 1 1 1 1 1 1 1 1 1 1 1 1
symmnumber: 1
zpe: 943036.1 jmol-1
zpe.correction: 0.359183 hartree
zpe.thermalcorrener: 0.379643 hartree
zpe.thermalcorrenthalpy: 0.380587 hartree
zpe.thermalcorrgfe: 0.310684 hartree
zpe.sumelectzpe: -1297.253337 hartree
zpe.sumelectthermal: -1297.232877 hartree
zpe.sumelectthermalent: -1297.231933 hartree
zpe.sumelectthermalfe: -1297.301836 hartree
dipole: -3.8316 1.8654 -3.0452
dipole: 5.2377
quadrupole: -128.7288 -122.0899 -145.3173
quadrupole: -3.1814 3.4344 -0.3099
quadrupole: 3.3165 9.9554 -13.2720 -3.1814 3.4344 -0.3099
hfenergy: -1297.6125201 hartree
pointgroup: C01 [X(C19H21N3S1)]
dipole: -1.525312 0.7110827 -1.1892018 debye
polarizability: 340.4771648|-30.9766327|264.571585|11.0540175|20.9945083|173.3915871 unknown
InChI: InChI=1S/C19H21N3S/c1-21-8-10-22(11-9-21)17-12-14-4-2-3-5-18(14)23-19-7-6-15(20)13-16(17)19/h2-7,12-13H,8-11,20H2,1H3
charge 0 multiplicity 1
44 atoms
S  2.181245 0.572721 1.934238
N  -1.628138 -0.785029 -0.002671
N  -4.380302 -1.656826 0.237982
N  -1.485868 4.125661 -1.372538
C  -2.505767 -0.285261 1.091277
C  -2.036525 -2.125583 -0.465818
C  -3.978898 -0.295215 0.658268
C  -3.522118 -2.122091 -0.873248
C  -0.244494 -0.444373 0.055933
C  0.014261 1.029479 0.135183
C  -5.81741 -1.754943 -0.077338
C  0.734278 -1.405552 -0.128382
C  1.06575 1.60684 0.897972
C  2.195533 -1.263906 -0.234639
C  -0.821803 1.892851 -0.621323
C  2.983184 -0.405988 0.591438
C  1.251432 3.008127 0.900117
C  -0.646753 3.301804 -0.618022
C  2.900841 -2.104292 -1.14989
C  0.404931 3.85816 0.166597
C  4.390282 -0.360702 0.477687
C  4.304773 -2.074517 -1.258392
C  5.059158 -1.195708 -0.444697
H  -2.199712 0.737696 1.36141
H  -2.390682 -0.930368 1.991044
H  -1.876948 -2.896498 0.323589
H  -1.429638 -2.401316 -1.346821
H  -4.61059 0.01517 1.511442
H  -4.123463 0.450261 -0.167681
H  -3.642152 -1.47648 -1.78272
H  -3.820699 -3.151678 -1.146668
H  -6.412101 -1.450564 0.802633
H  -6.075253 -2.802216 -0.317299
H  -6.127721 -1.115373 -0.942933
H  0.390889 -2.437437 -0.27195
H  -1.613684 1.436988 -1.227236
H  2.072003 3.43048 1.489159
H  2.320632 -2.782097 -1.788063
H  0.561155 4.943389 0.189098
H  4.954989 0.319717 1.123551
H  4.810813 -2.731471 -1.974819
H  6.151467 -1.16499 -0.521707
H  -2.216412 3.729732 -1.956149
H  -1.347484 5.131393 -1.390613
