program: Gaussian 09
title: 000210402
version: EM64L-G09RevD.01
frameworkgroup: C1[X(C12H17FO2)]
method: RPBEPBE
basis: SDD
operation: Freq
keyword: #p
keyword: freq=noraman
keyword: PBEPBE/SDD
title: #p freq=noraman PBEPBE/SDD
converged: YES YES NO NO
title: Mulliken charges:
elementType: F O O C C C C C C C C C C C C H H H H H H H H H H H H H H H H H
charge: -0.209079 -0.476437 -0.450035 0.142659 -0.496340 0.325513 0.403547 -0.720211 -0.719289 -0.740101 -0.403729 -0.341512 -0.392425 -0.363309 0.316897 0.202993 0.201893 0.253301 0.217001 0.200546 0.238551 0.204671 0.202671 0.229564 0.183220 0.266299 0.344058 0.340885 0.237468 0.293287 0.254224 0.253216
chargesum: 0.00000
title: Mulliken charges with hydrogens summed into heavy atoms:
elementType: F O O C C C C C C C C C C C C
charge: -0.209079 -0.132378 -0.109150 0.142659 -0.091453 0.325513 0.403547 -0.049363 -0.073396 -0.061017 -0.166261 -0.048225 -0.138201 -0.110093 0.316897
polarizability: 1.63053470e+02 -1.61530561e+01 1.09476580e+02 2.99595213e+00 3.63430873e+00 1.27902414e+02
1716.lowfreq: -16.3266 -6.5424 0.0006 0.0007 0.0009 2.2792 37.0653 46.9676 54.3650
frequency: 36.9812 46.7640 54.3292 124.9301 156.2968 180.5701 202.3796 214.9679 229.6031 237.8441 249.8914 259.3516 278.5064 295.6595 311.4954 336.8784 364.9630 377.3413 395.1023 411.8186 427.6399 437.1573 470.7014 507.8313 518.1323 588.9422 628.1448 659.6086 727.6711 748.9847 793.3779 815.7047 831.8141 842.1020 874.3810 888.5849 917.5740 936.3423 938.8117 970.3475 979.5040 999.2891 1005.4905 1039.3872 1050.7879 1102.0096 1117.2630 1138.6230 1152.2044 1157.2262 1166.3246 1194.3429 1200.3407 1230.9668 1290.2255 1332.5042 1339.6047 1358.6690 1372.9189 1375.4678 1384.8641 1391.6461 1400.3815 1439.2820 1457.4051 1463.0917 1464.0230 1466.7389 1473.8009 1490.6194 1494.4915 1599.0561 1611.0293 2959.3790 2971.6811 2974.5232 2990.9274 3012.0338 3063.6284 3069.1281 3082.6075 3092.0560 3098.9262 3119.9366 3124.8921 3167.1712 3171.9849 3196.0929 3537.7109 3569.1272
redmass: 3.9373 4.1379 4.6249 3.2656 2.9359 3.3852 1.4180 2.6111 1.1975 1.2244 1.4368 1.9948 1.9729 1.6884 1.9240 3.1295 4.6420 4.1532 2.2031 2.9812 2.5967 3.6809 3.1811 3.4967 2.9009 3.5066 7.2286 4.1233 3.7187 4.2165 6.1581 1.3078 3.2151 1.5314 1.9506 2.7537 1.5305 1.4112 1.7069 1.5918 1.3592 1.4533 2.8123 2.0249 2.0431 1.3621 1.5304 2.1562 1.3052 1.5587 2.7001 2.3749 2.3014 1.8237 1.2785 1.7981 1.6012 1.6378 1.5166 3.3981 1.2381 1.2475 3.5467 1.0776 1.0574 1.0509 1.0646 1.0917 1.0794 1.0558 2.4574 7.7810 6.4979 1.0585 1.0366 1.0382 1.0375 1.0993 1.0990 1.0968 1.0988 1.0988 1.1000 1.0989 1.0892 1.0905 1.0950 1.0951 1.0662 1.0658
irintensity: 0.6596 1.3288 0.2286 0.2590 6.1053 3.7701 26.3212 2.8136 12.0911 59.2503 31.9316 8.7666 28.6370 173.2611 66.3474 2.8079 13.9961 5.8665 1.3985 0.3230 4.6703 2.0563 0.3908 28.0497 16.9250 16.1919 0.1657 6.6272 3.7390 10.3016 12.2085 19.1064 22.1002 67.3379 2.3186 20.3263 2.9434 4.6777 21.4923 3.9093 0.9122 0.3209 14.4192 14.0107 32.9266 20.4133 69.7760 36.1684 28.6833 31.6132 4.4401 32.2733 44.2141 33.1613 3.4920 42.7162 1.1528 23.2781 20.4552 29.3668 5.2566 26.5736 5.7371 2.9421 2.9518 2.9726 12.8310 2.0687 7.1622 20.6892 109.9958 8.0587 12.1429 12.8630 25.5436 40.3161 29.8157 26.0698 37.0891 45.7539 17.7141 42.7807 16.6980 10.4118 14.8157 2.9483 3.5907 1.7780 11.9838 5.7218
temp: 298.150 k
press: 1.00000 atm
elementType: 9 8 8 6 6 6 6 6 6 6 6 6 6 6 6 1 1 1 1 1 1 1 1 1 1 1 1 1 1 1 1 1
symmnumber: 1
zpe: 689233.9 jmol-1
zpe.correction: 0.262515 hartree
zpe.thermalcorrener: 0.278757 hartree
zpe.thermalcorrenthalpy: 0.279701 hartree
zpe.thermalcorrgfe: 0.219719 hartree
zpe.sumelectzpe: -716.597504 hartree
zpe.sumelectthermal: -716.581263 hartree
zpe.sumelectthermalent: -716.580319 hartree
zpe.sumelectthermalfe: -716.640301 hartree
dipole: -3.3500 2.3646 -2.6758
dipole: 4.8963
quadrupole: -93.9070 -92.1210 -85.8830
quadrupole: -3.0029 1.3163 2.8149
quadrupole: -3.2700 -1.4840 4.7540 -3.0029 1.3163 2.8149
hfenergy: -716.8600198 hartree
pointgroup: C01 [X(C12H17F1O2)]
dipole: 1.3511546 1.0332003 0.9043077 debye
polarizability: 162.6831474|16.9473104|109.4477852|-0.0642604|-2.8683986|128.3015313 unknown
InChI: InChI=1S/C12H17FO2/c1-11(2,14)8-12(3,15)9-4-6-10(13)7-5-9/h4-7,14-15H,8H2,1-3H3
charge 0 multiplicity 1
32 atoms
F  -4.325612 -1.150637 0.2211
O  1.14624 1.609808 -1.408864
O  1.21511 -1.761144 -0.366377
C  0.878928 1.302664 0.015517
C  2.012511 0.421433 0.63112
C  2.402561 -0.9387 -0.033046
C  -0.498554 0.620307 0.055083
C  0.809463 2.649623 0.788237
C  3.287399 -1.728753 0.965147
C  3.131086 -0.774922 -1.380875
C  -1.053675 0.212243 1.296682
C  -1.255525 0.431622 -1.126877
C  -2.332478 -0.385973 1.363926
C  -2.536876 -0.158753 -1.080901
C  -3.046067 -0.5570 0.166028
H  1.730652 0.219298 1.685263
H  2.933118 1.040152 0.681582
H  0.034011 3.292158 0.337847
H  0.560412 2.500347 1.853836
H  1.781831 3.177768 0.738894
H  3.565586 -2.699277 0.519602
H  2.742003 -1.927057 1.907676
H  4.214223 -1.177801 1.213835
H  3.390194 -1.772307 -1.776767
H  4.064836 -0.195037 -1.25786
H  2.47484 -0.269582 -2.105558
H  2.008342 2.094097 -1.463443
H  0.554873 -1.711187 0.372192
H  -0.4994 0.363857 2.230454
H  -0.820784 0.7407 -2.079184
H  -2.769424 -0.704577 2.314759
H  -3.127723 -0.315569 -1.988127
