program: Gaussian 09
title: 000208144
version: EM64L-G09RevD.01
frameworkgroup: C1[X(C20H22N2S2)]
method: RPBEPBE
basis: SDD
operation: Freq
keyword: #p
keyword: freq=noraman
keyword: PBEPBE/SDD
title: #p freq=noraman PBEPBE/SDD
converged: YES YES NO NO
title: Mulliken charges:
elementType: S S N N C C C C C C C C C C C C C C C C C C C C H H H H H H H H H H H H H H H H H H H H H H
charge: 0.241531 0.199372 -0.210850 -0.058850 -0.382024 -0.400138 -0.378533 -0.388959 0.356667 0.336154 -0.614055 -0.476918 -0.420079 0.489050 -0.274622 -0.371604 -0.227361 -0.233735 -0.407855 -0.250504 -0.248177 -0.249797 -0.240665 -0.869612 0.230795 0.239674 0.220809 0.213569 0.173745 0.216156 0.213641 0.181567 0.226050 0.186901 0.225356 0.234456 0.278192 0.256319 0.235171 0.246158 0.252114 0.226842 0.229898 0.261326 0.264208 0.268621
chargesum: 0.00000
title: Mulliken charges with hydrogens summed into heavy atoms:
elementType: S S N N C C C C C C C C C C C C C C C C C C C C
charge: 0.241531 0.199372 -0.210850 -0.058850 0.088446 0.034240 0.011368 0.006248 0.356667 0.336154 0.024251 -0.242462 -0.420079 0.489050 0.003569 -0.371604 0.028958 -0.233735 -0.172684 -0.004346 0.003937 -0.022956 -0.010767 -0.075457
polarizability: 3.79103883e+02 -2.74743668e+01 2.74486073e+02 -2.71210737e+00 -2.58062463e+01 1.93185506e+02
1716.lowfreq: -0.0017 -0.0017 -0.0011 1.9671 5.0741 8.7966 27.1006 35.3218 41.8537
frequency: 27.0981 35.3059 41.8310 60.9276 65.8680 85.8227 103.4814 107.7523 152.7050 159.1882 183.6476 199.6316 222.2744 231.6694 235.5215 254.0870 273.8385 285.6921 291.1536 310.6308 327.6854 338.3904 350.5620 365.6931 379.2050 399.3340 426.2057 450.1890 468.2094 480.0291 489.7249 498.3306 529.3681 556.2804 587.2064 601.2785 645.4903 658.5204 669.4455 674.1295 687.4863 731.3841 738.3843 754.6870 755.3182 798.0949 811.4770 825.3143 825.5039 852.4418 873.4417 902.7334 916.1449 937.7099 949.1312 957.1494 967.4587 983.4275 989.7270 1004.7889 1014.7575 1028.7179 1038.3913 1045.6113 1050.9057 1071.7033 1078.8246 1090.9795 1117.1863 1124.7772 1133.0021 1147.0683 1149.5969 1163.2735 1169.9020 1197.8704 1218.8479 1225.5800 1242.1669 1255.2643 1256.7776 1287.4031 1293.0911 1333.9954 1340.5123 1342.9537 1349.7488 1355.0175 1367.3236 1368.7909 1374.4537 1375.2719 1401.0067 1419.4296 1431.4646 1451.6648 1452.8659 1454.1487 1456.3906 1460.3885 1463.1580 1464.8976 1466.5574 1474.1569 1481.5872 1554.1181 1559.6495 1579.2194 1593.8256 1609.5442 2817.5746 2836.6639 2861.6311 2915.2966 2935.8998 3002.9443 3021.1844 3028.4125 3034.0352 3047.4738 3079.4129 3083.4320 3115.7416 3118.2222 3119.5956 3132.3796 3134.0849 3136.6096 3147.4567 3156.4217 3161.0261 3164.8973
redmass: 3.8980 4.1880 5.4884 4.2027 3.1141 4.5518 4.8747 4.0954 4.0273 3.7036 5.2068 2.2943 1.4419 3.5071 1.3192 2.6470 5.3019 3.2698 2.6485 3.9009 2.8023 4.1680 7.3971 2.7409 5.0493 2.3131 4.5290 3.8347 4.1793 3.1072 4.3275 4.1955 4.1872 4.1876 3.9664 5.0601 4.0740 3.9551 6.9452 4.9557 6.1318 3.7872 4.6230 1.3481 3.1673 4.2849 2.4931 1.3780 2.2991 1.5995 1.5065 1.4654 3.5021 2.0191 1.4090 1.3473 1.1819 1.3305 1.3078 2.5623 4.4611 4.3021 2.6583 2.4646 1.7301 1.6367 1.7908 2.3979 1.7329 1.6649 2.0511 2.0256 2.3044 2.4150 1.0673 1.1128 1.8390 2.0348 2.1104 1.5023 1.4434 1.6301 1.4561 1.8479 1.2948 1.5705 1.5198 1.4387 2.8648 3.2435 2.4559 1.4765 2.3944 2.2080 1.1700 1.7769 1.0819 1.1163 1.0812 1.0803 2.5001 1.1263 1.1625 1.1030 1.0535 7.4862 6.2062 6.8252 6.4866 7.0231 1.0707 1.0686 1.0579 1.0679 1.0701 1.0292 1.0729 1.0879 1.0890 1.0914 1.1011 1.0910 1.0866 1.1057 1.0862 1.1022 1.0883 1.0881 1.0941 1.0899 1.0963 1.1006
irintensity: 0.6403 0.8107 0.7570 0.3457 0.3471 0.8064 0.4712 0.9322 2.5669 3.3838 2.9374 2.3476 0.3287 3.1959 0.2978 0.8336 1.3056 0.6614 2.2011 8.2190 1.9543 4.7719 1.3525 2.2819 0.6133 1.2314 1.5379 5.1954 14.1460 0.6572 1.2219 14.7250 3.0843 5.2426 1.9063 0.4210 9.0252 11.2157 1.2615 2.0717 4.1394 2.1195 3.7505 60.1128 1.4507 21.4037 8.5563 36.0335 41.2009 5.4857 5.3688 11.1261 16.5603 2.3187 2.4956 1.6899 8.1265 0.0243 10.1463 99.3919 22.7595 8.3711 8.4472 0.8397 2.4414 9.1701 2.3848 44.4410 22.8367 16.4207 1.1733 18.3189 61.0662 9.2810 0.0858 10.3397 59.5639 50.2011 7.5332 7.1375 7.5098 33.0421 22.8849 6.2275 0.1657 9.5492 18.5422 0.2546 29.2800 13.1914 9.2365 18.6639 29.0959 13.7447 1.9194 103.7784 10.1356 16.9436 5.8889 36.6677 21.0470 3.9471 19.3926 13.7892 8.7021 23.7277 15.4089 50.4290 10.1496 131.1589 80.5379 65.6824 185.6451 56.4090 73.4815 21.8188 47.8200 46.4040 56.5001 22.6955 29.2753 15.4207 6.6445 17.4439 17.1555 11.1001 6.2947 3.2282 21.8729 3.9233 8.3308 37.6039
temp: 298.150 k
press: 1.00000 atm
elementType: 16 16 7 7 6 6 6 6 6 6 6 6 6 6 6 6 6 6 6 6 6 6 6 6 1 1 1 1 1 1 1 1 1 1 1 1 1 1 1 1 1 1 1 1 1 1
symmnumber: 1
zpe: 974474.7 jmol-1
zpe.correction: 0.371158 hartree
zpe.thermalcorrener: 0.393414 hartree
zpe.thermalcorrenthalpy: 0.394358 hartree
zpe.thermalcorrgfe: 0.319438 hartree
zpe.sumelectzpe: -1679.180582 hartree
zpe.sumelectthermal: -1679.158326 hartree
zpe.sumelectthermalent: -1679.157382 hartree
zpe.sumelectthermalfe: -1679.232302 hartree
dipole: -3.2131 -1.5059 2.0675
dipole: 4.1069
quadrupole: -138.9054 -156.0970 -157.3646
quadrupole: 4.3802 -0.5276 -8.5691
quadrupole: 11.8836 -5.3080 -6.5756 4.3802 -0.5276 -8.5691
hfenergy: -1679.55174 hartree
pointgroup: C01 [X(C20H22N2S2)]
dipole: -1.2471971 -0.5238235 0.8836317 debye
polarizability: 378.9220531|-28.4127604|269.9529974|-4.2494873|-31.3648953|197.9004121 unknown
InChI: InChI=1S/C20H22N2S2/c1-21-9-11-22(12-10-21)18-13-15-5-3-4-6-19(15)24-20-8-7-16(23-2)14-17(18)20/h3-8,13-14H,9-12H2,1-2H3
charge 0 multiplicity 1
46 atoms
S  2.389827 0.42293 -2.036285
S  -2.216168 4.236368 0.521519
N  -1.374445 -1.116362 -0.123155
N  -3.995923 -2.326597 -0.331687
C  -2.231276 -0.905251 -1.323123
C  -1.662493 -2.4033 0.54019
C  -3.718244 -1.014634 -0.95637
C  -3.162275 -2.506234 0.877005
C  -0.039992 -0.617945 -0.165219
C  0.047019 0.846509 -0.467991
C  -5.430974 -2.541491 -0.06784
C  1.029379 -1.404501 0.226449
C  1.070937 1.440565 -1.250317
C  2.448828 -1.054764 0.394898
C  -0.953784 1.697404 0.085694
C  3.18778 -0.22822 -0.503798
C  1.078108 2.837157 -1.478062
C  -0.95496 3.085811 -0.150349
C  3.175958 -1.648023 1.472073
C  0.068942 3.662066 -0.947746
C  4.563594 0.026248 -0.311172
C  4.551322 -1.411992 1.661537
C  5.253375 -0.5664 0.76979
C  -3.338363 3.086522 1.488456
H  -1.994174 -1.67234 -2.093585
H  -2.020107 0.087362 -1.751426
H  -1.084174 -2.459697 1.479616
H  -1.372585 -3.266978 -0.101851
H  -3.989731 -0.166391 -0.271525
H  -4.328489 -0.919199 -1.873501
H  -3.365141 -3.505768 1.305118
H  -3.406093 -1.740858 1.660338
H  -5.999008 -2.450686 -1.010875
H  -5.860919 -1.813775 0.666925
H  -5.588554 -3.560616 0.328409
H  0.801479 -2.43704 0.518426
H  -1.719619 1.219299 0.702981
H  1.882777 3.273653 -2.078018
H  2.633944 -2.296678 2.171066
H  0.081515 4.739886 -1.14359
H  5.090085 0.675601 -1.018287
H  5.07538 -1.881953 2.501237
H  6.323095 -0.375904 0.908257
H  -3.798357 2.337097 0.824275
H  -4.121798 3.733524 1.912443
H  -2.783998 2.596192 2.303869
