program: Gaussian 09
title: 000210409
version: EM64L-G09RevD.01
frameworkgroup: C1[X(C15H21N2S)]
method: RPBEPBE
basis: SDD
operation: Freq
keyword: #p
keyword: freq=noraman
keyword: PBEPBE/SDD
title: #p freq=noraman PBEPBE/SDD
converged: YES YES NO NO
title: Mulliken charges:
elementType: S N N C C C C C C C C C C C C C C C H H H H H H H H H H H H H H H H H H H H H
charge: 0.320527 -0.178262 -0.139041 0.487796 -0.208000 -0.247488 0.470516 -0.479509 -0.642062 -0.770778 -0.360731 -0.319848 0.420742 -0.339565 -0.365579 -0.644416 -0.638992 -0.638875 0.249476 0.225475 0.285285 0.262405 0.268895 0.258362 0.259384 0.259830 0.244360 0.247606 0.261263 0.259558 0.230371 0.248536 0.223037 0.251673 0.240459 0.253367 0.241437 0.251320 0.251465
chargesum: 1.00000
title: Mulliken charges with hydrogens summed into heavy atoms:
elementType: S N N C C C C C C C C C C C C C C C
charge: 0.320527 -0.178262 -0.139041 0.487796 -0.208000 -0.247488 0.470516 -0.004558 0.174523 0.006797 -0.116371 -0.072242 0.420742 -0.078302 -0.106021 0.057527 0.106507 0.105347
polarizability: 4.23629877e+02 5.37814193e+00 1.83514935e+02 -6.93445118e+00 1.02252413e+01 1.12048489e+02
1716.lowfreq: -6.5559 -4.9687 -1.3578 0.0023 0.0025 0.0028 21.1521 38.1372 46.8073
frequency: 21.0480 38.1155 46.7943 65.0760 83.3896 92.4314 124.6960 139.0624 172.1460 174.4834 180.9290 189.6014 203.6091 211.1437 230.8982 241.3154 265.9636 300.7115 306.0384 348.0979 366.0589 403.9561 419.9090 427.6977 470.2586 479.4113 509.5628 522.2169 540.4050 560.3723 587.5500 623.2063 633.7994 648.6795 731.9165 734.6909 767.6825 805.8179 829.9657 847.3166 913.3747 931.8755 948.8307 959.1225 967.3501 986.3727 994.7437 1041.2543 1050.9705 1053.2508 1063.8327 1095.6069 1101.7500 1115.7561 1116.0574 1120.7003 1146.8230 1167.6499 1204.3563 1223.4021 1241.0817 1256.2463 1288.4899 1302.6426 1318.1311 1329.3623 1369.0754 1384.5891 1400.0994 1408.5278 1428.0124 1434.6274 1452.0739 1454.7946 1466.8910 1468.1265 1470.0593 1470.4322 1474.6848 1475.9907 1480.2045 1485.1900 1486.8004 1490.2894 1494.6703 1507.7003 1524.2484 1550.3627 1620.7458 1634.1524 2972.7114 2977.7351 2990.5615 2994.6575 2995.0193 3015.0168 3050.9565 3052.7135 3053.6920 3070.0938 3094.3423 3104.3173 3115.1758 3120.4389 3122.4861 3132.3913 3134.1851 3140.6502 3156.7788 3181.5235 3184.5936
redmass: 2.4949 4.1153 3.0671 3.7368 2.0244 3.4193 2.8637 1.2067 1.9737 1.8260 1.2450 1.3526 1.8413 1.5048 3.0838 2.7558 3.2725 2.4929 2.8330 2.8632 3.0171 5.1453 3.3454 3.0967 4.4569 3.8173 4.5426 4.2526 3.5539 4.3403 4.9361 5.6066 5.1348 3.7923 3.7177 4.2994 1.4984 1.2605 1.8343 2.7213 3.0784 3.2064 3.6521 1.3440 1.3646 2.6963 2.0008 1.4744 2.3243 1.5838 1.9167 1.2340 1.7626 1.3493 1.3596 1.9717 1.6389 1.6528 2.4027 1.2561 2.5471 1.2077 3.0353 2.4620 1.9843 1.5493 3.6534 2.4288 1.1963 1.2685 1.6117 1.1516 1.1922 1.1190 1.2360 1.0726 1.0393 1.5554 1.2970 1.0472 1.0646 1.0554 1.1562 1.2652 1.3439 1.4211 4.9890 3.4987 7.1048 6.2472 1.0368 1.0388 1.0408 1.0573 1.0417 1.0359 1.1004 1.0975 1.1032 1.0979 1.1004 1.1011 1.1001 1.0958 1.0980 1.0960 1.0904 1.1020 1.0881 1.0938 1.0952
irintensity: 0.1332 1.7231 1.1381 0.7273 0.7967 0.1360 2.3714 2.4975 0.2757 1.4303 0.4518 0.2204 0.4570 1.5355 1.6633 3.0626 6.0624 0.6695 0.4061 0.6806 4.6985 2.0388 0.2537 7.0517 2.1320 4.3659 3.2501 9.0604 16.2790 4.6469 0.6008 1.1902 8.0444 4.1196 0.1205 20.9972 19.0733 8.2145 74.3492 9.3983 28.9631 19.1097 0.7452 1.0760 0.6653 0.8667 4.7955 2.5611 1.7459 21.5028 17.3416 0.7346 6.6317 0.5941 2.3596 10.8838 3.0702 4.5798 66.8810 85.9250 17.8423 1.4883 34.5915 18.5827 1.8625 15.9383 11.1353 91.4576 12.3548 66.0349 342.5458 11.1947 47.7391 35.9306 7.0146 6.2405 0.4032 17.1776 42.5774 13.3938 28.4988 24.7771 34.6455 4.5670 17.2689 384.5472 23.1313 0.9042 375.2346 418.8964 47.3897 84.9096 9.3223 10.0892 21.4676 12.1811 1.5998 4.0419 42.5263 6.3194 36.3065 25.2422 5.9372 7.0245 2.3549 24.4164 1.2392 2.0868 3.0571 6.6711 4.0983
temp: 298.150 k
press: 1.00000 atm
elementType: 16 7 7 6 6 6 6 6 6 6 6 6 6 6 6 6 6 6 1 1 1 1 1 1 1 1 1 1 1 1 1 1 1 1 1 1 1 1 1
symmnumber: 1
zpe: 863568.9 jmol-1
zpe.correction: 0.328916 hartree
zpe.thermalcorrener: 0.348594 hartree
zpe.thermalcorrenthalpy: 0.349538 hartree
zpe.thermalcorrgfe: 0.280033 hartree
zpe.sumelectzpe: -1090.196853 hartree
zpe.sumelectthermal: -1090.177175 hartree
zpe.sumelectthermalent: -1090.176231 hartree
zpe.sumelectthermalfe: -1090.245736 hartree
dipole: -0.5641 2.6723 -0.3875
dipole: 2.7586
quadrupole: -20.2553 -90.6928 -113.7817
quadrupole: 6.6534 -2.5689 3.5881
quadrupole: 54.6547 -15.7829 -38.8718 6.6534 -2.5689 3.5881
hfenergy: -1090.5257693 hartree
pointgroup: C01 [X(C15H21N2S1)]
dipole: 0.2223205 -1.0286803 0.2651115 debye
polarizability: 423.3799713|9.1083895|165.8543749|8.6245937|-32.3705469|129.9589551 unknown
InChI: InChI=1S/C15H21N2S/c1-6-14-11(2)17(5)15(18-14)12-7-9-13(10-8-12)16(3)4/h7-10H,6H2,1-5H3
charge 1 multiplicity 1
39 atoms
S  -1.96871 1.239223 -0.641827
N  -1.821175 -1.210516 0.228204
N  4.704116 0.275147 0.046492
C  -3.22485 -0.955087 0.115751
C  -0.99077 -0.168729 -0.109617
C  -3.507437 0.306629 -0.363531
C  0.450372 -0.108341 -0.063799
C  -4.825286 0.971207 -0.654132
C  -1.32266 -2.566528 0.56583
C  -4.2163 -2.022974 0.490437
C  1.153209 0.734892 -0.987851
C  1.238327 -0.794875 0.919635
C  3.331335 0.157551 0.016403
C  2.539893 0.862119 -0.960302
C  2.626378 -0.666793 0.963886
C  -5.095926 2.233259 0.208482
C  5.401353 1.156105 -0.913887
C  5.499009 -0.471626 1.043294
H  -4.869163 1.245877 -1.726306
H  -5.634434 0.235913 -0.496329
H  -0.331624 -2.713215 0.112611
H  -1.252282 -2.704754 1.658053
H  -2.01318 -3.31698 0.155111
H  -4.008219 -2.440704 1.491567
H  -5.233098 -1.603918 0.514551
H  -4.224271 -2.858433 -0.234203
H  0.593144 1.271198 -1.763179
H  0.753907 -1.385834 1.702543
H  3.022589 1.499433 -1.704438
H  3.173613 -1.186943 1.753305
H  -5.089676 1.990935 1.285172
H  -6.083085 2.655754 -0.044696
H  -4.338789 3.017724 0.029242
H  5.238653 0.825007 -1.957076
H  6.481963 1.128851 -0.713994
H  5.063514 2.204971 -0.817774
H  6.568193 -0.280009 0.87402
H  5.331009 -1.561371 0.955907
H  5.255159 -0.156566 2.075841
