program: Gaussian 09
title: 000210398
version: EM64L-G09RevD.01
frameworkgroup: C1[X(C14H15NO2)]
method: RPBEPBE
basis: SDD
operation: Freq
keyword: #p
keyword: freq=noraman
keyword: PBEPBE/SDD
title: #p freq=noraman PBEPBE/SDD
converged: YES YES NO NO
title: Mulliken charges:
elementType: O O N C C C C C C C C C C C C C C H H H H H H H H H H H H H H H
charge: -0.266872 -0.240096 -0.005422 0.419404 0.120192 0.272484 -0.541764 -0.082056 -0.564853 -0.360885 0.102168 -0.689184 -0.301943 -0.253347 -0.230721 -0.256137 -0.662081 0.255755 0.207595 0.250462 0.263505 0.226296 0.221159 0.232767 0.262773 0.229270 0.232940 0.223312 0.236151 0.220379 0.247229 0.231521
chargesum: 0.00000
title: Mulliken charges with hydrogens summed into heavy atoms:
elementType: O O N C C C C C C C C C C C C C C
charge: -0.266872 -0.240096 -0.005422 0.419404 0.120192 0.272484 -0.078414 -0.082056 -0.314391 -0.097379 0.102168 -0.008963 -0.039170 -0.024077 0.002219 0.203326 0.037047
polarizability: 2.17486072e+02 2.13119234e+01 1.91273194e+02 2.03175932e+00 -1.53025788e+01 9.67106151e+01
1716.lowfreq: -0.0007 -0.0006 -0.0003 3.8966 7.1558 11.7800 34.7740 47.5272 55.5135
frequency: 34.3239 47.5087 55.4902 70.9118 86.7115 103.6223 157.2587 187.6451 201.0535 204.0210 220.4584 250.8758 297.4328 331.7106 344.1738 386.1549 414.9268 444.8202 457.1624 484.3853 528.8595 543.8199 579.9081 629.7457 666.6031 692.3841 721.9979 747.5525 771.4073 784.5249 789.5852 809.1982 820.8373 843.0341 885.1573 906.9658 934.4045 965.6172 970.8493 997.7828 1004.4900 1021.8052 1029.1794 1062.4361 1079.6922 1096.4983 1113.9570 1154.9862 1159.8018 1191.0778 1208.9752 1235.6580 1266.1626 1279.1289 1280.4167 1316.6038 1333.2337 1354.2179 1374.3102 1383.3270 1392.2202 1393.2417 1429.6978 1451.9472 1455.8643 1463.9389 1475.0190 1475.9152 1484.7099 1485.9358 1493.6631 1554.8915 1560.1110 1609.4468 1619.9011 2983.0753 2995.0887 3005.2637 3030.4238 3066.3001 3081.5583 3090.2847 3091.1262 3094.7451 3108.1111 3120.4151 3133.3033 3149.9398 3169.6287 3177.5314
redmass: 3.6362 2.9214 3.7164 3.2956 5.2189 3.4565 3.1046 3.9159 1.1925 4.6225 1.3019 3.3933 2.7687 4.6285 2.8548 5.1592 3.8643 3.2248 4.2300 4.0353 7.0543 4.0358 4.6050 5.8468 3.8801 5.2497 4.5292 3.3674 1.8073 2.1816 1.3058 2.2737 1.7989 3.9922 1.7986 3.5739 1.4153 3.0337 1.3901 1.3300 2.8419 3.7044 2.1089 1.9198 1.8380 2.1473 2.2651 1.6747 1.4444 2.0498 2.5981 1.7419 1.4741 1.1334 1.5136 2.0037 2.9533 1.3065 2.3029 2.4895 1.2060 1.2302 4.0994 2.4054 1.1121 1.0433 1.0613 1.0442 1.0571 1.0901 3.3255 7.4269 7.5414 9.4979 6.3189 1.0349 1.0362 1.0644 1.0590 1.0971 1.0999 1.0974 1.1006 1.1038 1.0908 1.1060 1.0863 1.0907 1.0957 1.0981
irintensity: 0.5891 0.5739 0.0717 1.9735 0.7221 0.6788 2.2294 1.5835 0.4532 1.2492 2.2629 0.5691 4.3614 9.4275 6.4047 0.0966 4.2087 5.4599 0.9844 9.3282 0.1803 1.0283 4.5918 7.2506 5.7233 8.2089 0.6242 6.4571 40.0731 46.0538 5.7133 5.1864 0.5692 7.2388 0.3496 13.3864 12.7625 12.1919 3.3869 0.3944 20.0190 106.6159 12.1532 19.7285 72.6458 16.6952 65.2574 38.4802 72.2161 121.2087 14.0020 17.4357 18.9159 5.9459 3.6448 17.5386 7.2317 1.5828 8.7315 4.4330 10.9727 24.6529 2.1419 7.0541 15.0767 15.2596 2.9256 16.0524 12.2959 15.6756 46.3868 6.3780 8.0078 112.3272 1.4337 33.6109 19.1780 32.7164 29.7087 2.4711 50.2688 36.7741 28.3479 0.7271 29.8920 29.1476 5.1787 13.6305 12.5016 18.2877
temp: 298.150 k
press: 1.00000 atm
elementType: 8 8 7 6 6 6 6 6 6 6 6 6 6 6 6 6 6 1 1 1 1 1 1 1 1 1 1 1 1 1 1 1
symmnumber: 1
zpe: 675651.7 jmol-1
zpe.correction: 0.257342 hartree
zpe.thermalcorrener: 0.273236 hartree
zpe.thermalcorrenthalpy: 0.274180 hartree
zpe.thermalcorrgfe: 0.213099 hartree
zpe.sumelectzpe: -746.469048 hartree
zpe.sumelectthermal: -746.453154 hartree
zpe.sumelectthermalent: -746.452210 hartree
zpe.sumelectthermalfe: -746.513291 hartree
dipole: 2.8841 -0.8280 -0.8799
dipole: 3.1270
quadrupole: -86.5591 -92.2023 -107.0595
quadrupole: 6.2499 -3.5869 2.6830
quadrupole: 8.7146 3.0713 -11.7859 6.2499 -3.5869 2.6830
hfenergy: -746.7263898 hartree
pointgroup: C01 [X(C14H15N1O2)]
dipole: 1.1346336 0.3333105 0.339139 debye
polarizability: 217.6547248|-21.2749432|190.8515585|-2.2856011|-15.9378353|96.963598 unknown
InChI: InChI=1S/C14H15NO2/c1-3-10-9-15-12-8-6-5-7-11(12)13(10)14(16)17-4-2/h5-9H,3-4H2,1-2H3
charge 0 multiplicity 1
32 atoms
O  2.475936 0.371483 0.580626
O  1.538978 1.295609 -1.339229
N  -2.122227 -1.804104 0.63615
C  0.329637 -1.656717 0.336345
C  0.234056 -0.287166 0.010635
C  -1.065729 0.351587 -0.023937
C  1.616951 -2.466544 0.331106
C  -2.222567 -0.456632 0.312767
C  -0.896024 -2.349623 0.633191
C  -1.277236 1.734562 -0.34379
C  1.444621 0.530688 -0.347456
C  2.130116 -2.7651 -1.104524
C  -3.528032 0.129442 0.322459
C  -2.562896 2.281061 -0.324734
C  -3.698971 1.478444 0.009728
C  3.724599 1.165673 0.334873
C  3.602179 2.563201 0.947272
H  2.400568 -1.935185 0.895867
H  1.42929 -3.425805 0.849349
H  -0.844743 -3.417456 0.883965
H  -0.426144 2.358493 -0.628286
H  1.369765 -3.307879 -1.694356
H  3.043765 -3.385441 -1.065673
H  2.374112 -1.833939 -1.647066
H  -4.367755 -0.521574 0.58377
H  -2.704435 3.338166 -0.575418
H  -4.698708 1.925939 0.01787
H  4.509262 0.566313 0.823813
H  3.900674 1.215716 -0.753834
H  4.564276 3.098594 0.844458
H  2.825106 3.151616 0.431847
H  3.353682 2.502178 2.020609
