program: Gaussian 09
title: 000208140
version: EM64L-G09RevD.01
frameworkgroup: C1[X(C13H11NO2)]
method: RPBEPBE
basis: SDD
operation: Freq
keyword: #p
keyword: freq=noraman
keyword: PBEPBE/SDD
title: #p freq=noraman PBEPBE/SDD
converged: YES YES NO NO
title: Mulliken charges:
elementType: O O N C C C C C C C C C C C C C H H H H H H H H H H H
charge: -0.418946 -0.225923 -0.717162 0.359602 0.294239 0.005344 -0.490188 -0.399688 0.193455 0.076831 -0.302610 -0.362166 -0.359741 -0.237174 -0.231275 -0.229435 0.290312 0.270874 0.240234 0.267915 0.271166 0.231792 0.232107 0.232464 0.312036 0.314702 0.381234
chargesum: 0.00000
title: Mulliken charges with hydrogens summed into heavy atoms:
elementType: O O N C C C C C C C C C C C C C
charge: -0.037711 -0.225923 -0.090424 0.359602 0.294239 0.005344 -0.199876 -0.128814 0.193455 0.076831 -0.062376 -0.094251 -0.088575 -0.005382 0.000832 0.003029
polarizability: 2.31878132e+02 -6.79824364e+00 1.54146427e+02 -1.37009343e+01 -4.09407265e+00 8.39065891e+01
1716.lowfreq: -35.6145 -5.7093 -0.0005 -0.0003 -0.0001 6.0555 10.1928 44.1712 56.7591
frequency: -35.1966 44.1340 56.7537 72.1893 116.0241 172.3734 201.7852 246.8353 265.5486 293.8745 299.9798 363.3828 404.6911 416.3534 439.9236 448.4994 518.2441 568.1887 584.9046 614.4071 633.7474 685.6189 698.7798 712.6216 722.9031 735.0223 770.5990 797.1630 818.7135 838.5018 861.3003 868.5659 907.2716 946.0574 959.9424 963.4537 989.3563 990.3765 1004.5982 1026.8575 1083.9962 1105.2284 1131.6832 1142.7278 1174.1784 1186.2122 1188.9136 1218.5956 1263.0434 1276.7333 1313.3653 1319.1149 1379.9962 1383.8489 1433.3562 1450.2916 1476.4632 1493.5368 1534.2356 1572.7963 1587.9931 1608.2791 1623.8351 1633.8883 3128.1299 3133.2858 3138.6673 3150.4572 3159.6454 3168.2594 3169.2293 3173.7285 3204.6966 3450.0856 3564.3053
redmass: 1.0940 5.2478 4.7146 5.0787 6.3641 4.7555 5.6597 4.6840 5.6306 4.0367 4.6245 8.3310 2.9444 4.3739 3.2414 4.0761 5.8088 5.4300 5.3442 6.4290 5.8594 5.1440 3.0246 2.1029 1.3900 2.4091 4.7150 1.9976 1.0909 1.6474 1.2772 5.0863 1.5266 1.4812 2.0502 1.8096 4.9981 1.4558 1.3316 2.1644 1.5959 2.2763 1.9223 1.3115 1.0573 1.5300 1.1306 2.2775 1.9012 2.1659 2.2569 1.5834 6.4875 8.6477 2.2676 3.2894 2.2571 3.2176 9.2164 4.3433 6.0176 6.0346 6.5851 1.2391 1.0851 1.0898 1.0882 1.0925 1.0960 1.0944 1.1007 1.0929 1.0617 1.0453 1.0973
irintensity: 18.1690 3.0026 1.4256 1.3304 1.1071 0.6841 3.2779 1.3160 0.3108 12.2891 6.1893 3.9490 0.1251 3.0128 9.5192 12.4715 1.3927 4.8371 11.2189 0.1131 21.9232 11.0920 7.8386 49.8920 202.4294 31.4087 4.1031 12.2459 116.0304 53.5891 7.7499 50.7602 15.6933 1.7838 13.9368 21.0652 3.0463 2.6653 0.5666 3.9417 13.0514 22.4723 3.5689 1.5663 0.4583 26.5297 18.0898 165.4602 6.0775 192.9361 188.2949 87.8062 28.2741 3.4295 14.5463 24.1102 5.2591 38.2640 198.7097 27.4540 5.0993 17.3951 8.0678 27.1380 0.1286 11.5799 6.7310 18.7294 20.9212 2.7154 23.7879 1.3364 165.3711 6.1185 15.4706
temp: 298.150 k
press: 1.00000 atm
elementType: 8 8 7 6 6 6 6 6 6 6 6 6 6 6 6 6 1 1 1 1 1 1 1 1 1 1 1
symmnumber: 1
zpe: 544793.4 jmol-1
zpe.correction: 0.207501 hartree
zpe.thermalcorrener: 0.220369 hartree
zpe.thermalcorrenthalpy: 0.221313 hartree
zpe.thermalcorrgfe: 0.167421 hartree
zpe.sumelectzpe: -706.065366 hartree
zpe.sumelectthermal: -706.052498 hartree
zpe.sumelectthermalent: -706.051553 hartree
zpe.sumelectthermalfe: -706.105445 hartree
dipole: -3.0397 -1.6125 1.3599
dipole: 3.6999
quadrupole: -55.9336 -101.4025 -92.9642
quadrupole: -9.2969 -5.1582 -2.8077
quadrupole: 27.4999 -17.9691 -9.5307 -9.2969 -5.1582 -2.8077
hfenergy: -706.2728666 hartree
pointgroup: C01 [X(C13H11N1O2)]
dipole: 1.189765 -0.8294518 -0.123987 debye
polarizability: 229.9530562|-4.3327424|133.9372422|-21.6870054|-31.857798|106.0408497 unknown
InChI: InChI=1S/C13H11NO2/c14-11-7-6-10(8-12(11)15)13(16)9-4-2-1-3-5-9/h1-8,15H,14H2
charge 0 multiplicity 1
27 atoms
O  2.867686 -1.436875 1.6466
O  -1.013941 2.105716 -1.333268
N  4.729151 -0.645966 -0.10587
C  0.640141 0.523076 -0.60134
C  -1.925632 0.184166 -0.214755
C  -0.780385 1.000111 -0.748858
C  1.05579 -0.287828 0.486807
C  1.591197 0.974706 -1.558644
C  2.415495 -0.643066 0.600201
C  3.369594 -0.19796 -0.361846
C  2.947216 0.609247 -1.440742
C  -1.883984 -1.233848 -0.124213
C  -3.123105 0.865616 0.135286
C  -3.016269 -1.952054 0.318895
C  -4.245954 0.149075 0.593225
C  -4.19513 -1.263458 0.687262
H  0.353393 -0.619831 1.255808
H  1.245175 1.619441 -2.371886
H  3.681355 0.953792 -2.178471
H  -0.981749 -1.774711 -0.427281
H  -3.1486 1.955577 0.032997
H  -2.980122 -3.045605 0.373334
H  -5.159961 0.684242 0.87305
H  -5.069972 -1.822282 1.038412
H  5.148613 -1.205915 -0.855227
H  5.368018 0.084813 0.227797
H  3.855583 -1.549976 1.451729
