program: Gaussian 09
title: 000208139
version: EM64L-G09RevD.01
frameworkgroup: C1[X(C11H17NO2)]
method: RPBEPBE
basis: SDD
operation: Freq
keyword: #p
keyword: freq=noraman
keyword: PBEPBE/SDD
title: #p freq=noraman PBEPBE/SDD
converged: YES YES NO NO
title: Mulliken charges:
elementType: O O N C C C C C C C C C C C H H H H H H H H H H H H H H H H H
charge: -0.232192 -0.216263 -0.297657 -0.058354 -0.360349 -0.162309 -0.695805 -0.705668 -0.717282 0.088732 0.234706 -0.346004 -0.249634 -0.155252 0.190108 0.208617 0.192939 0.246588 0.256882 0.194182 0.204910 0.245518 0.202565 0.214503 0.214370 0.226272 0.243505 0.220166 0.285015 0.260917 0.266273
chargesum: 0.00000
title: Mulliken charges with hydrogens summed into heavy atoms:
elementType: O O N C C C C C C C C C C C
charge: -0.232192 -0.216263 -0.040775 0.131755 0.041207 0.084279 -0.051195 -0.074230 -0.027339 0.088732 0.234706 -0.060989 0.011283 0.111021
polarizability: 1.74816052e+02 -1.03980350e+01 1.12576072e+02 -1.55769032e+01 -8.52939225e+00 1.15688862e+02
1716.lowfreq: -17.1267 -10.1709 -3.9507 -0.0005 -0.0002 0.0006 24.0540 28.4393 43.3161
frequency: 23.6749 27.5164 43.3138 71.2645 106.0776 124.0520 153.3362 167.2113 194.6787 204.8447 223.9628 231.9921 256.1201 293.7880 306.3250 371.3410 402.8321 445.8356 463.5117 506.2896 588.2431 600.2730 670.5531 727.1387 740.2519 753.1012 821.2984 844.3688 847.5880 869.5358 899.1271 906.9998 917.6376 921.6002 941.7075 955.5249 965.1600 1013.9562 1045.8956 1052.4388 1056.3347 1091.5516 1132.7187 1134.8072 1143.5247 1180.7561 1184.5716 1206.4435 1234.7301 1258.3474 1266.5775 1291.0674 1324.7296 1334.5832 1362.7184 1367.6850 1371.8621 1379.7322 1391.3716 1452.2373 1456.2901 1463.2049 1467.8965 1470.8568 1477.0468 1480.2179 1482.3733 1489.9434 1556.2814 1568.5555 2894.0377 2949.5549 2966.9521 2970.3312 2987.2422 2996.1554 3016.1280 3056.8846 3064.6407 3071.6243 3086.5088 3087.1119 3102.2942 3225.8568 3243.6958 3265.5135 3414.1880
redmass: 4.0428 2.9281 4.0371 3.8477 3.0408 4.0467 3.0676 5.0894 1.2954 1.5493 1.3144 1.1389 2.2619 4.6266 2.7601 3.1568 2.3049 3.7321 3.7433 3.2310 2.8970 5.7905 1.9098 3.7497 2.6151 1.2570 2.7554 1.3367 5.3105 6.0073 1.6412 1.3937 1.2243 1.3725 1.6458 2.4363 1.7282 1.4891 1.8579 3.7598 2.4490 1.7170 2.4818 1.6256 2.7755 2.1522 2.1534 2.0588 1.6198 1.7817 1.4136 1.3201 1.3942 1.4431 1.3596 2.4471 1.2433 1.2767 1.2280 1.5966 2.0870 1.0608 1.0520 1.0674 1.0538 1.0935 1.0822 1.0555 6.4973 9.0567 1.0672 1.0825 1.0358 1.0366 1.0350 1.0923 1.0839 1.0990 1.0986 1.0994 1.0996 1.0991 1.1004 1.0913 1.0990 1.1091 1.0729
irintensity: 0.5632 1.0101 0.2887 2.4992 2.4166 2.4075 1.5653 0.1303 2.2874 2.1296 0.8779 0.2369 3.8233 19.9590 0.2743 0.5881 1.3425 1.0508 1.0347 15.4266 9.3488 0.8429 78.4678 5.3835 63.3900 84.2975 2.0919 20.2226 50.7640 1.5588 5.1252 1.9191 5.9782 0.9056 0.6657 28.8636 13.4565 49.1104 24.3234 6.4198 26.3932 5.7662 60.0249 10.4987 27.4617 12.5817 6.4581 5.1656 35.1439 16.7293 11.9581 2.7945 2.4308 2.5342 5.6680 6.7664 17.1323 24.7751 15.2381 66.2533 46.1463 4.9684 1.1968 20.8821 9.0116 5.4553 5.0360 19.2700 97.0549 85.3143 69.9375 15.5737 34.5150 41.1225 22.8882 36.0479 11.0160 12.1720 88.3872 53.1529 29.9816 27.1372 23.1223 1.7160 0.9707 0.2790 0.2981
temp: 298.150 k
press: 1.00000 atm
elementType: 8 8 7 6 6 6 6 6 6 6 6 6 6 6 1 1 1 1 1 1 1 1 1 1 1 1 1 1 1 1 1
symmnumber: 1
zpe: 682936.7 jmol-1
zpe.correction: 0.260117 hartree
zpe.thermalcorrener: 0.275676 hartree
zpe.thermalcorrenthalpy: 0.276621 hartree
zpe.thermalcorrgfe: 0.215540 hartree
zpe.sumelectzpe: -633.445842 hartree
zpe.sumelectthermal: -633.430282 hartree
zpe.sumelectthermalent: -633.429338 hartree
zpe.sumelectthermalfe: -633.490419 hartree
dipole: 2.9897 -0.2506 -1.7591
dipole: 3.4779
quadrupole: -70.5555 -85.7782 -86.3987
quadrupole: -1.6598 -5.3909 1.3893
quadrupole: 10.3553 -4.8674 -5.4879 -1.6598 -5.3909 1.3893
hfenergy: -633.7059584 hartree
pointgroup: C01 [X(C11H17N1O2)]
dipole: 1.1700804 0.3183508 0.6339031 debye
polarizability: 175.7461692|11.3580652|104.1913639|11.6916048|-3.6531598|123.1434527 unknown
InChI: InChI=1S/C11H17NO2/c1-8(2)7-12-9(3)11(13)10-5-4-6-14-10/h4-6,8-9,12H,7H2,1-3H3
charge 0 multiplicity 1
31 atoms
O  2.419506 0.061137 1.234346
O  0.520407 -0.429776 -1.83822
N  -1.609614 -0.763751 0.022057
C  -3.620167 0.668677 -0.407101
C  -2.095461 0.629856 -0.137035
C  -0.214358 -0.904588 0.464533
C  -4.420005 0.125334 0.798265
C  -4.060855 2.103721 -0.777734
C  0.096081 -2.387699 0.795557
C  0.810054 -0.420696 -0.60129
C  2.140081 0.022895 -0.161278
C  3.272884 0.442603 -0.858169
C  4.289298 0.752008 0.112536
C  3.736233 0.509453 1.364411
H  -3.819794 0.011403 -1.281687
H  -1.568847 1.17369 -0.957489
H  -1.882991 1.172524 0.807108
H  -0.073619 -0.306884 1.384968
H  -1.759242 -1.29709 -0.848584
H  -4.323493 0.808076 1.665355
H  -5.495607 0.034347 0.557456
H  -4.035836 -0.86475 1.099073
H  -3.845405 2.805065 0.051862
H  -5.147516 2.144412 -0.976653
H  -3.533627 2.470487 -1.678412
H  1.123788 -2.511685 1.179009
H  -0.616538 -2.738091 1.560995
H  -0.019992 -3.018362 -0.105413
H  3.342932 0.511827 -1.941383
H  5.298084 1.108691 -0.084254
H  4.107416 0.597666 2.382067
