program: Gaussian 09
title: 000016704
version: EM64L-G09RevD.01
frameworkgroup: C1[X(C6H10O3)]
method: RPBEPBE
basis: SDD
operation: Freq
keyword: #pfreq=noraman
keyword: PBEPBE/SDD
title: #p freq=noraman PBEPBE/SDD
converged: YES YES NO NO
title: Mulliken charges:
elementType: O O O C C C C C C H H H H H H H H H H
charge: -0.305053 -0.289462 -0.274459 -0.036751 -0.049868 -0.346372 -0.360258 -0.274753 -0.245203 0.245042 0.251259 0.225921 0.222826 0.225888 0.214366 0.202138 0.201122 0.188416 0.205199
chargesum: 0.00000
title: Mulliken charges with hydrogens summed into heavy atoms:
elementType: O O O C C C C C C
charge: -0.305053 -0.289462 -0.274459 0.208291 0.201392 0.102375 0.079997 0.128507 0.148413
polarizability: 9.42558724e+01 -4.07718361e+00 6.46893887e+01 -9.71014608e-01 -8.26250912e-01 5.84003308e+01
1716.lowfreq: -3.7955 -0.0006 -0.0006 0.0005 6.4401 8.3592 38.9047 45.7710 87.4100
frequency: 38.8396 45.7667 87.4064 99.8309 133.5290 223.5900 273.9052 360.0749 388.1632 441.9163 491.8056 703.1282 744.3527 795.8275 815.0347 870.9126 894.7530 926.1938 952.9087 973.2004 1023.8284 1036.5749 1053.9675 1095.5018 1097.4504 1109.3205 1114.7046 1133.5283 1149.6010 1204.9399 1216.2212 1237.7331 1239.6518 1310.4786 1353.5455 1404.0667 1431.5743 1455.4204 1474.1143 1483.0183 1485.6124 2913.2457 2931.8302 2978.9835 2987.7851 3062.1733 3071.3924 3113.4375 3115.0011 3168.3030 3180.8096
redmass: 5.3221 3.0652 3.5806 3.9396 3.7387 3.7665 4.2834 3.7888 2.2869 2.4454 4.6193 5.6033 7.6016 4.3262 2.9335 2.1454 1.1772 4.4485 1.5064 1.5183 1.3356 1.5677 5.6469 1.4601 1.4212 1.3795 1.3070 1.4815 1.7603 1.2867 1.2435 1.4414 1.4538 1.2364 1.5062 1.9878 1.8146 1.1045 1.1710 1.2253 1.1499 1.0589 1.0567 1.1004 1.1052 1.0534 1.0531 1.0916 1.0911 1.1180 1.1191
irintensity: 3.2688 9.7433 3.3700 3.6138 8.1118 7.8095 0.9780 13.4072 2.4138 4.2297 3.7731 10.0045 7.2196 40.2912 31.0153 11.9110 3.1299 6.6607 1.6147 6.3007 0.9577 12.0647 179.8926 4.6243 0.9029 7.0983 12.6843 8.3446 1.6272 1.0139 7.9121 2.5955 1.5972 26.5693 10.4165 3.3427 1.7612 8.0201 4.4874 2.2226 3.7139 49.8705 71.7954 51.2435 32.1337 31.7719 24.2452 13.7584 16.3036 32.2157 30.2367
temp: 298.150 k
press: 1.00000 atm
elementType: 8 8 8 6 6 6 6 6 6 1 1 1 1 1 1 1 1 1 1
symmnumber: 1
zpe: 400120.7 jmol-1
zpe.correction: 0.152398 hartree
zpe.thermalcorrener: 0.162213 hartree
zpe.thermalcorrenthalpy: 0.163157 hartree
zpe.thermalcorrgfe: 0.115590 hartree
zpe.sumelectzpe: -459.454364 hartree
zpe.sumelectthermal: -459.444549 hartree
zpe.sumelectthermalent: -459.443605 hartree
zpe.sumelectthermalfe: -459.491171 hartree
dipole: 2.0254 -2.1072 0.3482
dipole: 2.9434
quadrupole: -58.7353 -54.1409 -51.0833
quadrupole: -12.8569 -1.4275 0.6163
quadrupole: -4.0821 0.5123 3.5699 -12.8569 -1.4275 0.6163
hfenergy: -459.6067616 hartree
pointgroup: C01 [X(C6H10O3)]
dipole: -0.7895233 -0.8451839 -0.0577259 debye
dipolederiv: -0.6507235 0.1083419 -0.0529072 0.1384831 -0.3825641 0.0979325 -0.0551447 0.0936489 -0.3908871 -0.3396956 0.0125991 -0.0642901 0.1026257 -0.6475566 -0.0279912 -0.0479837 -0.0587733 -0.3454443 -1.2584666 -0.0556673 -0.0343759 -0.0315933 -0.4127831 -0.0205157 -0.0188553 0.0048175 -0.3865666 0.2950158 0.0589486 -0.0438106 -0.0429199 0.1593281 -0.0293019 -0.096552 0.0335479 0.3122894 0.1392536 -0.0426042 0.0581731 -0.1752931 0.2759572 -0.0023997 0.0702672 -0.0264919 0.2931679 0.1590436 -0.1244194 -0.0889417 0.0036652 0.2103514 -0.0081807 -0.0653184 -0.0747733 0.2384869 0.1489731 0.020303 0.0625979 0.0946422 0.1880854 -0.0814395 0.0508114 -0.0300746 0.2640149 0.742246 -0.0092746 0.1357439 -0.205444 0.3950739 0.0463458 0.2677251 0.0247068 0.2923045 0.8027565 0.1083779 -0.1085119 0.2554042 0.3859174 0.0689697 -0.2346987 0.0478302 0.2408527 0.030582 -0.0364631 0.0123792 -0.0434558 0.0674595 -0.0623412 0.0248763 -0.0438355 -0.1087278 0.0641213 0.0365908 0.0319841 0.0743811 0.0683656 0.0035456 0.0010112 -0.0197187 -0.0978226 0.0379459 -0.0514411 0.0902977 -0.0623582 -0.0417978 0.0666942 0.0818391 0.0951767 0.006734 0.0851295 0.070802 0.0836726 0.0357203 -0.0167919 -0.0403833 0.0825164 -0.078257 -0.0349664 -0.1091308 -0.0442925 -0.0864165 -0.0354739 0.0764072 0.0283737 -0.1069762 0.0047998 0.0160914 0.0567333 -0.0366704 -0.0096673 -0.0718678 0.0391294 0.0890976 0.0369644 0.105551 -0.0900184 -0.0286675 0.0087043 0.0087087 0.0221271 0.0306654 -0.0917941 -0.0727263 -0.0401661 -0.1637779 -0.0547209 -0.0513961 -0.0197706 0.0555519 -0.2190187 0.0270326 -0.0375933 -0.0063905 0.0562762 -0.08373 0.040124 0.0141979 -0.07768 -0.2224039 -0.0071119 0.0326649 -0.0246888 0.0584428 -0.0366655 -0.0125627 0.0109367 -0.036515 0.0461756 -0.0565325 0.0871727 -0.0069092 -0.1604496 unknown
polarizability: 94.2307522|4.1685495|64.8564387|-0.8170655|0.1742322|58.2584011 unknown
InChI: InChI=1S/C6H10O3/c1(5-3-8-5)7-2-6-4-9-6/h5-6H,1-4H2
charge 0 multiplicity 1
19 atoms
O  3.705013 -0.249491 0.268971
O  -2.95769 1.109501 -0.021912
O  0.008141 -0.241756 -0.445315
C  2.403927 -0.179482 -0.498644
C  -2.386707 -0.167823 -0.594816
C  3.070928 1.085279 -0.062201
C  -3.757845 -0.168903 0.008252
C  1.208219 -0.729149 0.247749
C  -1.222485 -0.77996 0.143177
H  2.485084 -0.481222 -1.55043
H  -2.283792 -0.147732 -1.687176
H  3.620643 1.686738 -0.79539
H  2.666809 1.628642 0.800918
H  -4.635313 -0.188294 -0.649019
H  -3.90592 -0.592986 1.010557
H  1.223895 -0.382138 1.303328
H  1.2309 -1.841941 0.246272
H  -1.238624 -1.889696 0.035133
H  -1.288384 -0.528988 1.224146
