program: Gaussian 09
title: 000208131
version: EM64L-G09RevD.01
frameworkgroup: C1[X(C11H18N4O3)]
method: RPBEPBE
basis: SDD
operation: Freq
keyword: #p
keyword: freq=noraman
keyword: PBEPBE/SDD
title: #p freq=noraman PBEPBE/SDD
converged: YES YES NO NO
title: Mulliken charges:
elementType: O O O N N N N C C C C C C C C C C C H H H H H H H H H H H H H H H H H H
charge: -0.282759 -0.264067 -0.265721 -0.414760 -0.254131 -0.205945 -0.501643 -0.032308 -0.374695 -0.708954 -0.694267 0.463147 0.232231 0.306319 -0.390630 0.202282 -0.678729 -0.602120 0.239695 0.255857 0.211977 0.201312 0.229918 0.206823 0.200715 0.220601 0.224958 0.289515 0.322753 0.321991 0.233232 0.307800 0.234212 0.245919 0.273881 0.245591
chargesum: 0.00000
title: Mulliken charges with hydrogens summed into heavy atoms:
elementType: O O O N N N N C C C C C C C C C C C
charge: -0.282759 -0.264067 -0.265721 -0.125245 -0.254131 -0.205945 -0.178890 0.207387 0.093139 -0.070901 -0.047992 0.463147 0.232231 0.306319 -0.068639 0.202282 0.096515 0.163271
polarizability: 2.29389703e+02 -1.03236126e+01 1.71027359e+02 9.80864292e+00 -1.22922070e+00 9.82061518e+01
1716.lowfreq: -17.2409 -6.8731 -0.6522 -0.0001 0.0005 0.0008 7.1618 26.5443 43.5641
frequency: -9.2694 26.1933 43.5431 52.0046 65.7461 88.3191 103.5560 112.8993 119.1215 181.5798 196.2170 209.0747 220.5223 232.8681 244.2870 257.6287 266.0967 308.7166 314.5083 323.7244 348.2466 370.8735 384.4827 404.9541 415.0771 462.0714 481.4140 536.0259 542.8499 612.5934 634.7551 654.1343 684.4165 704.8380 710.6008 727.2544 749.2531 813.7996 855.5080 872.8508 886.3861 915.9375 935.8551 949.2627 964.7329 991.0127 1038.3410 1082.5225 1120.5320 1130.9722 1133.9048 1150.0540 1168.8357 1177.6951 1180.6227 1208.7289 1230.7821 1244.0469 1257.4863 1265.0183 1305.3488 1331.9490 1339.5298 1352.4792 1364.6734 1377.4030 1397.9830 1421.7477 1432.9412 1443.5763 1466.4415 1471.0338 1475.1930 1476.4058 1478.6528 1482.3968 1487.3075 1490.5784 1508.0238 1512.0422 1577.3017 1634.3064 1652.3134 1667.9434 2964.0901 2966.9056 2971.9744 2988.3012 3002.8668 3009.2905 3050.1684 3055.3283 3065.3835 3069.2239 3077.2592 3079.2425 3101.1196 3106.4351 3136.2659 3236.1432 3546.4978 3556.1340
redmass: 3.5934 4.4240 4.8850 2.8147 5.3088 3.3194 1.1822 3.9861 3.0229 3.3750 1.0788 1.9824 3.5089 1.5045 1.5118 2.2806 2.9668 3.8499 3.9742 2.9551 1.5939 2.6412 4.9575 5.0599 1.8915 5.7086 5.6232 1.4834 3.2720 4.8978 8.0118 5.7104 5.3245 5.1805 7.6554 7.6279 4.8162 2.6630 1.3836 1.8722 3.1218 1.2271 2.1861 1.5414 2.0266 2.4996 3.4573 3.9300 1.2887 1.3090 2.3541 1.9203 2.3550 1.8240 2.8461 2.1354 3.4188 3.3651 2.4464 1.3208 1.2615 3.0077 1.3748 2.4024 1.4580 1.2420 1.2185 1.3172 1.2721 1.1090 1.0555 1.1147 1.0831 1.0444 1.1776 1.0851 1.1939 1.2135 1.0975 2.2031 7.0169 8.5323 5.0014 7.1352 1.0366 1.0363 1.0369 1.0708 1.0760 1.0327 1.1035 1.0990 1.0983 1.0988 1.1003 1.0993 1.1022 1.0952 1.1021 1.0930 1.0771 1.0760
irintensity: 0.5206 0.0639 8.4535 0.5003 2.4783 1.6000 2.7572 1.0657 11.2247 0.4962 0.2190 0.4320 2.8768 0.8954 1.1264 1.7199 1.9131 0.1754 5.6624 6.3961 20.4423 9.0578 12.9423 20.5345 5.3118 1.4088 13.1114 138.3256 65.8876 6.7436 0.0497 5.6894 0.3466 4.8852 11.6662 15.6348 2.3832 10.3155 50.8217 3.6176 8.8252 8.2396 30.7418 10.1690 21.5732 6.2845 9.1524 1.6510 0.0759 0.1308 3.0353 23.8001 63.9981 38.9940 138.2605 218.8594 104.6126 19.5233 52.0267 76.9511 6.1476 112.5034 6.0381 13.5861 11.7758 22.4447 14.4349 87.5934 64.7846 25.1449 18.9045 94.6427 60.2416 17.9653 269.7337 38.7109 109.1011 195.0582 72.6572 565.5682 191.1986 155.8660 332.6869 497.2647 32.3485 58.1543 27.7418 17.6400 33.4447 31.7269 25.2449 38.3542 40.7359 19.6551 40.6198 44.7833 19.4497 2.7327 0.9323 24.2114 9.9661 35.8497
temp: 298.150 k
press: 1.00000 atm
elementType: 8 8 8 7 7 7 7 6 6 6 6 6 6 6 6 6 6 6 1 1 1 1 1 1 1 1 1 1 1 1 1 1 1 1 1 1
symmnumber: 1
zpe: 768574.0 jmol-1
zpe.correction: 0.292734 hartree
zpe.thermalcorrener: 0.311581 hartree
zpe.thermalcorrenthalpy: 0.312525 hartree
zpe.thermalcorrgfe: 0.245018 hartree
zpe.sumelectzpe: -873.316249 hartree
zpe.sumelectthermal: -873.297403 hartree
zpe.sumelectthermalent: -873.296458 hartree
zpe.sumelectthermalfe: -873.363965 hartree
dipole: -6.0034 6.8352 -0.4094
dipole: 9.1065
quadrupole: -107.8438 -116.9905 -107.8404
quadrupole: -4.0434 -0.4086 -2.9223
quadrupole: 3.0478 -6.0989 3.0511 -4.0434 -0.4086 -2.9223
hfenergy: -873.6089833 hartree
pointgroup: C01 [X(C11H18N4O3)]
dipole: -2.3713058 2.5785763 -0.7510597 debye
polarizability: 229.3224654|-7.5306507|167.0487194|12.6756998|-16.4122371|102.2520287 unknown
InChI: InChI=1S/C11H18N4O3/c1-7(2)6-12-10(17)13-8-5-9(16)15(4)11(18)14(8)3/h5,7,12-13H,6H2,1-4H3
charge 0 multiplicity 1
36 atoms
O  4.089448 1.852702 -0.124653
O  -1.634694 -1.426478 -0.257121
O  2.969914 -2.597111 0.842113
N  -2.771176 0.550712 -0.754357
N  1.840574 1.199656 -0.303475
N  3.533715 -0.365863 0.354771
N  -0.442291 0.61263 -0.509186
C  -4.83242 -0.145867 0.563293
C  -4.090126 -0.106552 -0.799612
C  -5.114419 1.274048 1.105621
C  -6.140901 -0.953603 0.406326
C  0.862247 0.188267 -0.202771
C  3.219104 0.937681 -0.026703
C  -1.623557 -0.185336 -0.482924
C  1.206435 -1.096316 0.174132
C  2.576064 -1.447906 0.482403
C  1.510993 2.583449 -0.695272
C  4.957243 -0.643862 0.645843
H  -4.17411 -0.677772 1.278507
H  -3.924221 -1.138671 -1.154077
H  -4.713725 0.420504 -1.548356
H  -5.758764 1.843866 0.406782
H  -5.638712 1.225662 2.077223
H  -4.181621 1.847472 1.265835
H  -6.823094 -0.469067 -0.3196
H  -6.675779 -1.026502 1.370436
H  -5.939564 -1.98173 0.053165
H  -2.740557 1.569574 -0.806771
H  -0.546192 1.577775 -0.823459
H  0.446257 -1.871208 0.237466
H  1.096301 2.629541 -1.720601
H  2.457677 3.144898 -0.684126
H  0.817844 3.055627 0.026446
H  5.575024 -0.434654 -0.242948
H  5.023965 -1.706134 0.92293
H  5.308917 -0.004635 1.472418
