program: Gaussian 09
title: 000208129
version: EM64L-G09RevD.01
frameworkgroup: C1[X(C10H14N4O3)]
method: RPBEPBE
basis: SDD
operation: Freq
keyword: #p
keyword: freq=noraman
keyword: PBEPBE/SDD
title: #p freq=noraman PBEPBE/SDD
converged: YES YES NO NO
title: Mulliken charges:
elementType: O O O N N N N C C C C C C C C C C H H H H H H H H H H H H H H
charge: -0.282687 -0.265280 -0.270147 -0.254159 -0.205802 -0.499853 -0.411926 0.464874 0.233660 -0.389928 0.202601 -0.678469 -0.601900 0.342802 -0.453516 -0.021849 -0.535666 0.322403 0.234082 0.233535 0.308017 0.321784 0.245989 0.273843 0.245839 0.287124 0.261117 0.229452 0.211779 0.219422 0.232859
chargesum: 0.00000
title: Mulliken charges with hydrogens summed into heavy atoms:
elementType: O O O N N N N C C C C C C C C C C
charge: -0.282687 -0.265280 -0.270147 -0.254159 -0.205802 -0.178069 -0.124802 0.464874 0.233660 -0.067525 0.202601 0.097165 0.163771 0.342802 0.037054 0.189930 -0.083385
polarizability: 2.06076109e+02 7.70820532e+00 1.65385903e+02 -5.36335585e-01 -1.87847340e+00 8.73124026e+01
1716.lowfreq: -10.8883 -3.5251 -0.0005 0.0004 0.0007 3.6253 13.6378 26.8915 41.3670
frequency: 11.5086 26.8541 41.3477 59.3792 75.0941 90.4655 108.6736 111.4920 120.8285 179.4829 221.6638 237.5923 247.4997 259.9850 295.3920 309.8598 323.9041 348.7435 379.8257 384.2483 403.4703 411.8927 472.9134 512.0029 537.7596 610.4919 633.6084 635.4654 668.5381 684.9853 703.4409 712.5736 727.4215 758.1634 858.2026 885.5218 904.3171 919.5276 960.8299 967.5488 990.8401 997.4078 1038.4200 1070.9876 1119.6882 1131.4940 1142.5101 1168.5149 1180.9658 1196.4202 1230.9056 1244.2083 1257.7700 1262.5726 1290.1460 1333.0258 1343.7570 1357.1706 1422.9848 1428.8794 1433.1780 1448.5506 1474.8864 1477.5956 1478.7537 1487.3084 1507.2151 1514.4944 1577.6789 1634.5766 1652.8552 1659.7321 1668.6312 2967.1734 2998.1334 3009.9832 3050.4866 3077.4297 3092.4450 3102.0083 3103.4357 3106.1454 3136.4094 3202.5456 3236.5008 3543.0987 3554.4771
redmass: 3.7773 4.4778 4.6314 4.3243 3.0926 2.6358 1.9947 1.9485 2.3562 3.1801 3.4433 2.6117 1.6490 4.4043 1.6158 4.5431 3.0377 4.5014 2.2685 4.5360 4.2129 2.5607 6.9361 6.1324 1.2019 4.4906 4.0783 7.2137 2.5545 5.3110 5.0172 8.2335 7.6509 4.9502 1.3727 3.1754 2.0250 2.2435 2.0733 1.4034 1.9780 1.3675 3.5098 3.9761 1.2891 1.3086 1.9299 2.5149 2.9026 2.0533 3.4383 3.3857 2.3662 1.2479 1.2408 2.8725 1.3289 2.5877 1.3149 1.1666 1.2813 1.1380 1.0941 1.0597 1.2082 1.4644 1.0451 2.4273 6.9465 8.5517 4.8950 4.7655 6.8558 1.0361 1.0656 1.0328 1.1036 1.0826 1.0784 1.1022 1.0895 1.0952 1.1021 1.1153 1.0931 1.0776 1.0757
irintensity: 0.5403 0.0506 3.7519 8.6935 1.0476 0.2843 3.6278 1.1602 9.1204 0.7775 3.5075 1.2727 0.6962 2.2064 7.7871 0.6474 7.0374 16.8721 9.9350 12.1789 24.2864 1.4618 9.9505 12.4443 187.8728 15.2534 17.4285 3.4783 17.9795 1.0432 4.5512 12.5481 15.9462 5.8224 49.6242 9.6961 18.9615 11.1381 4.9200 115.5475 1.0789 26.7733 10.2930 9.6355 0.0690 0.1452 4.1531 94.0302 124.8457 282.5933 96.9194 21.2078 61.5472 74.4381 2.3907 104.6152 12.4818 6.9663 83.3765 10.3207 67.6391 50.4929 83.7519 54.8403 286.9954 269.5947 19.6981 639.0503 189.8698 152.5548 320.5140 49.1275 434.7730 57.2467 46.2103 31.3742 25.6557 12.1683 7.3607 19.2183 10.0672 2.7572 0.8936 22.1509 24.7680 10.5564 34.5969
temp: 298.150 k
press: 1.00000 atm
elementType: 8 8 8 7 7 7 7 6 6 6 6 6 6 6 6 6 6 1 1 1 1 1 1 1 1 1 1 1 1 1 1
symmnumber: 1
zpe: 635258.4 jmol-1
zpe.correction: 0.241957 hartree
zpe.thermalcorrener: 0.259840 hartree
zpe.thermalcorrenthalpy: 0.260784 hartree
zpe.thermalcorrgfe: 0.193340 hartree
zpe.sumelectzpe: -832.886312 hartree
zpe.sumelectthermal: -832.868429 hartree
zpe.sumelectthermalent: -832.867485 hartree
zpe.sumelectthermalfe: -832.934929 hartree
dipole: 5.5804 7.1279 0.1537
dipole: 9.0538
quadrupole: -97.7742 -105.5420 -99.9835
quadrupole: 8.5727 1.4701 -3.3475
quadrupole: 3.3257 -4.4421 1.1164 8.5727 1.4701 -3.3475
hfenergy: -833.1282687 hartree
pointgroup: C01 [X(C10H14N4O3)]
dipole: -2.1062668 -2.8075679 0.6078083 debye
polarizability: 205.5552263|8.7438333|163.8689691|-2.0823038|-12.6243377|89.3502192 unknown
InChI: InChI=1S/C10H14N4O3/c1-4-5-11-9(16)12-7-6-8(15)14(3)10(17)13(7)2/h4,6,11-12H,1,5H2,2-3H3
charge 0 multiplicity 1
31 atoms
O  3.8394 -1.521311 0.565329
O  2.4780 2.780828 -0.71008
O  -2.072157 1.049599 -0.81928
N  1.553051 -1.134419 0.194368
N  3.163059 0.623475 -0.069694
N  -0.765288 -0.817835 -0.159143
N  -3.087318 -1.013036 -0.410262
C  0.51823 -0.243087 -0.158887
C  2.918486 -0.712176 0.24691
C  0.792656 1.075471 -0.468702
C  2.145933 1.588275 -0.44097
C  1.30013 -2.549435 0.527182
C  4.57326 1.067719 -0.015605
C  -1.98702 -0.162921 -0.484842
C  -4.45512 -0.486886 -0.618834
C  -5.175559 -0.17807 0.684374
C  -5.546906 1.068894 1.064016
H  -0.012722 1.753831 -0.73966
H  0.860548 -3.096092 -0.328826
H  0.658931 -2.64849 1.423867
H  2.279796 -2.996768 0.754822
H  -0.822023 -1.80441 0.094596
H  4.981793 0.912577 0.996444
H  4.581255 2.135871 -0.277683
H  5.18261 0.489142 -0.729392
H  -2.987884 -1.979637 -0.0965
H  -4.353377 0.429626 -1.222567
H  -5.023035 -1.230146 -1.210994
H  -5.396794 -1.035995 1.33793
H  -6.067853 1.250662 2.011041
H  -5.331082 1.94424 0.439841
