program: Gaussian 09
title: 000208128
version: EM64L-G09RevD.01
frameworkgroup: C1[X(C8H12N4O3)]
method: RPBEPBE
basis: SDD
operation: Freq
keyword: #p
keyword: freq=noraman
keyword: PBEPBE/SDD
title: #p freq=noraman PBEPBE/SDD
converged: YES YES NO NO
title: Mulliken charges:
elementType: O O O N N N N C C C C C C C C H H H H H H H H H H H H
charge: -0.282683 -0.265299 -0.271851 -0.253265 -0.205503 -0.495377 -0.422035 0.465321 0.234303 -0.389246 0.203129 -0.678275 -0.602029 0.335892 -0.600940 0.322525 0.308256 0.233745 0.233799 0.322086 0.274007 0.246098 0.245881 0.294666 0.285260 0.230954 0.230582
chargesum: 0.00000
title: Mulliken charges with hydrogens summed into heavy atoms:
elementType: O O O N N N N C C C C C C C C
charge: -0.282683 -0.265299 -0.271851 -0.253265 -0.205503 -0.173291 -0.127369 0.465321 0.234303 -0.066721 0.203129 0.097526 0.163957 0.335892 0.145856
polarizability: 1.86999069e+02 1.20558514e+01 1.42310393e+02 -2.72570023e-02 -2.21424446e-02 6.61824353e+01
1716.lowfreq: -0.0009 -0.0003 0.0006 0.1742 5.1776 11.8679 35.1653 46.6835 79.5779
frequency: 35.1618 46.6649 79.5750 100.2445 101.8486 110.7033 117.8493 141.6943 182.8983 220.9500 257.3347 263.0812 267.2666 309.9431 324.2663 361.2254 369.4070 385.0598 406.3025 472.8119 515.3845 557.4813 613.0742 635.3186 649.9343 684.6552 710.5238 710.7209 727.2594 751.9442 858.7462 885.6269 929.1486 977.7674 1038.4612 1083.7056 1119.8050 1127.5959 1131.4957 1136.3557 1169.2658 1182.5310 1211.7994 1231.6738 1245.1035 1258.9072 1333.1107 1356.6434 1422.4418 1426.9410 1434.5006 1458.2773 1475.4198 1476.6643 1481.7507 1487.6166 1510.9547 1514.6926 1519.6995 1578.0349 1634.8229 1654.7882 1673.8343 2967.9204 2983.3049 3009.6216 3051.2552 3063.9750 3101.4036 3105.9444 3115.7311 3136.6341 3234.0541 3547.4061 3557.9099
redmass: 3.3785 4.4714 3.1558 1.1481 1.2130 4.5463 3.2850 2.6383 3.6096 3.6065 1.2578 4.7598 5.8599 3.5413 3.0141 5.7515 1.4847 5.1924 5.1514 7.3032 8.0357 1.1724 5.1256 8.0896 6.4457 5.4176 5.3189 11.2197 7.6685 4.8666 1.3696 3.2330 3.9828 2.3325 3.4943 4.1765 1.2885 1.2783 1.3083 1.5641 2.4312 2.7947 2.1367 3.4159 3.4171 2.4149 3.1660 2.8417 1.3217 1.1581 1.2843 1.2930 1.0581 1.0569 1.1251 1.0440 1.0450 1.7382 1.8449 6.7978 8.6081 5.1740 6.2351 1.0360 1.0352 1.0327 1.1037 1.1031 1.1022 1.0953 1.0981 1.1021 1.0932 1.0766 1.0765
irintensity: 7.0785 2.4507 0.7764 2.3532 0.1470 0.8531 7.3150 6.6909 0.1270 3.1671 0.4566 4.8315 0.1244 0.0044 7.8053 17.0638 9.5902 12.3928 23.9110 9.9843 19.5333 212.7523 6.8624 0.0005 5.7439 0.3924 1.4081 14.5537 16.1780 1.6285 52.1075 9.7786 7.1230 50.9198 7.9435 1.3162 0.0635 0.0542 0.1619 50.4542 53.7024 151.3760 241.2511 104.4739 19.8233 47.4251 103.9728 11.6439 95.8864 26.6743 70.5240 229.0193 13.0366 14.4210 106.3873 17.6995 19.9222 721.4106 203.1493 184.4502 146.6758 410.4291 416.5888 57.9962 82.0937 30.6664 25.5935 36.2675 19.3981 2.7415 1.2618 0.9058 24.7933 11.0142 36.5314
temp: 298.150 k
press: 1.00000 atm
elementType: 8 8 8 7 7 7 7 6 6 6 6 6 6 6 6 1 1 1 1 1 1 1 1 1 1 1 1
symmnumber: 1
zpe: 550365.5 jmol-1
zpe.correction: 0.209623 hartree
zpe.thermalcorrener: 0.225261 hartree
zpe.thermalcorrenthalpy: 0.226205 hartree
zpe.thermalcorrgfe: 0.166021 hartree
zpe.sumelectzpe: -755.641668 hartree
zpe.sumelectthermal: -755.626030 hartree
zpe.sumelectthermalent: -755.625086 hartree
zpe.sumelectthermalfe: -755.685271 hartree
dipole: 6.0944 6.8845 -0.0071
dipole: 9.1945
quadrupole: -75.3798 -98.7953 -88.7921
quadrupole: 12.5604 -0.0247 -0.0119
quadrupole: 12.2759 -11.1396 -1.1364 12.5604 -0.0247 -0.0119
hfenergy: -755.8512916 hartree
pointgroup: C01[X(C8H12N4O3)]
dipole: 2.3533393 2.7464239 0.0662766 debye
polarizability: 186.5834213|12.7529875|142.6898483|1.4305882|1.3529557|66.2186277 unknown
InChI: InChI=1S/C8H12N4O3/c1-9-7(14)10-5-4-6(13)12(3)8(15)11(5)2/h4,9-10H,1-3H3
charge 0 multiplicity 1
27 atoms
O  -2.984341 1.860033 0.003021
O  -1.989972 -2.721821 -0.062283
O  2.713975 -1.457784 0.008451
N  -0.729764 1.203055 0.01444
N  -2.490927 -0.423916 -0.029887
N  1.562334 0.616716 0.028946
N  3.90302 0.553009 0.052187
C  0.22944 0.16884 0.007589
C  -2.132355 0.922721 -0.003991
C  -0.157475 -1.157768 -0.017882
C  -1.555251 -1.532117 -0.03845
C  -0.355239 2.630088 0.041998
C  -3.94006 -0.721979 -0.049496
C  2.730537 -0.197034 0.028461
C  5.217621 -0.100375 0.055912
H  0.590228 -1.947365 -0.022481
H  -1.297169 3.199804 0.041184
H  0.222712 2.91654 -0.85729
H  0.202849 2.886657 0.962641
H  1.701474 1.62734 0.04769
H  -4.039225 -1.816847 -0.081173
H  -4.410566 -0.262643 -0.9343
H  -4.424997 -0.314894 0.853124
H  3.87279 1.573076 0.064448
H  5.047587 -1.188158 0.031293
H  5.787626 0.149391 0.969546
H  5.810845 0.186829 -0.831494
