program: Gaussian 09
title: 000208119
version: EM64L-G09RevD.01
frameworkgroup: C1[X(C10H16N4O3)]
method: RPBEPBE
basis: SDD
operation: Freq
keyword: #p
keyword: freq=noraman
keyword: PBEPBE/SDD
title: #p freq=noraman PBEPBE/SDD
converged: YES YES NO NO
title: Mulliken charges:
elementType: O O O N N N N C C C C C C C C C C H H H H H H H H H H H H H H H H
charge: -0.282885 -0.265760 -0.266605 -0.253723 -0.205766 -0.499986 -0.416747 0.462518 0.232755 -0.361855 -0.390339 -0.342666 0.202516 -0.678503 0.320135 -0.602114 -0.687393 0.262205 0.211521 0.322245 0.208502 0.234062 0.322653 0.233267 0.307822 0.234185 0.289732 0.245996 0.273933 0.245587 0.207294 0.233760 0.203654
chargesum: 0.00000
title: Mulliken charges with hydrogens summed into heavy atoms:
elementType: O O O N N N N C C C C C C C C C C
charge: -0.282885 -0.265760 -0.266605 -0.253723 -0.205766 -0.177333 -0.127015 0.462518 0.232755 0.111870 -0.068094 0.099897 0.202516 0.096771 0.320135 0.163401 -0.042684
polarizability: 2.15004445e+02 -1.09332961e+01 1.59657177e+02 9.13602297e+00 -2.25641526e+00 8.90613821e+01
1716.lowfreq: -15.6325 -6.5378 -0.0006 -0.0005 -0.0004 4.9127 12.4395 29.1909 45.1553
frequency: 7.5152 28.5926 45.1297 62.5488 83.7586 93.6892 112.0308 120.5395 126.0279 184.2934 215.6588 220.4097 229.1378 249.0209 261.5568 290.0727 310.3594 324.6547 351.1308 373.8745 385.4469 406.0200 467.2495 480.8258 522.1159 543.3431 612.4695 635.0851 646.3413 684.4438 702.6697 709.8057 727.3076 730.2753 777.7563 856.3917 863.4079 878.2409 887.7866 950.1676 976.4606 1018.7029 1040.6104 1089.7544 1107.1104 1120.8906 1131.2516 1135.1788 1168.9721 1181.3508 1205.4157 1230.7683 1244.6351 1251.5878 1258.4006 1282.8373 1332.3396 1343.2454 1353.4387 1364.0387 1388.3876 1423.0153 1434.2597 1451.1073 1465.3761 1474.9209 1477.6056 1478.2462 1478.9422 1483.8979 1490.8588 1509.0973 1514.6400 1577.5620 1634.4192 1652.8717 1668.6895 2967.1743 2971.4354 2992.5974 2999.2480 3009.3476 3043.0219 3050.3396 3069.8917 3077.6196 3084.2854 3101.2661 3106.0035 3136.1562 3234.9511 3547.2180 3556.4817
redmass: 3.5943 4.0755 4.9271 4.4826 2.7915 3.1116 1.7192 1.7036 2.6318 3.3813 1.2390 3.3202 2.8739 1.3681 4.6990 3.3810 4.0008 2.9472 1.6351 2.4724 5.0666 5.0425 4.6944 3.7167 5.1892 1.2223 4.8074 8.0452 6.0871 5.3264 4.9362 9.2309 7.5065 2.2581 1.8420 1.3860 2.5942 1.7528 2.9839 2.7505 2.0971 2.1819 3.0731 2.5342 2.6652 1.2896 1.3086 1.8961 2.4251 2.7905 2.0745 3.3419 3.2838 1.2440 2.3688 1.2365 3.0995 1.4069 2.1414 1.4669 1.2361 1.3180 1.2776 1.1098 1.0739 1.1010 1.0566 1.1564 1.0668 1.1224 1.4008 1.0636 2.3480 6.8560 8.5283 4.9733 6.8117 1.0362 1.0365 1.0616 1.0654 1.0328 1.0984 1.1035 1.1006 1.0980 1.1005 1.1022 1.0953 1.1021 1.0932 1.0771 1.0759
irintensity: 0.3186 0.0863 7.7473 3.0804 0.1506 1.5252 7.1645 4.8170 3.6759 0.4097 0.2258 3.1006 1.0360 0.5195 4.5657 2.3734 0.0347 6.1872 25.5019 9.9339 11.8682 24.2643 3.2590 9.1673 18.4145 184.5672 8.7045 0.0330 7.0886 0.4324 3.3979 14.0525 15.7162 8.4577 13.3544 46.4306 12.3119 3.6242 12.5381 44.1937 10.3148 10.5662 6.4391 2.8446 0.9692 0.0947 0.1391 3.2879 63.2459 148.6579 237.3771 94.8340 18.5301 22.4441 68.9556 75.8636 113.7860 2.6211 9.3571 4.8859 21.1484 88.9643 63.6340 33.0202 11.0157 105.7063 40.9972 225.9285 4.8744 55.7757 343.3846 39.4445 567.7714 186.1984 153.3640 352.1441 483.1734 56.4002 31.5983 26.2666 42.9270 31.5751 0.5809 25.5795 88.5529 35.2033 17.6203 19.4371 2.6972 0.9167 24.5486 9.4230 35.1168
temp: 298.150 k
press: 1.00000 atm
elementType: 8 8 8 7 7 7 7 6 6 6 6 6 6 6 6 6 6 1 1 1 1 1 1 1 1 1 1 1 1 1 1 1 1
symmnumber: 1
zpe: 697094.4 jmol-1
zpe.correction: 0.265509 hartree
zpe.thermalcorrener: 0.283791 hartree
zpe.thermalcorrenthalpy: 0.284735 hartree
zpe.thermalcorrgfe: 0.216485 hartree
zpe.sumelectzpe: -834.090869 hartree
zpe.sumelectthermal: -834.072587 hartree
zpe.sumelectthermalent: -834.071643 hartree
zpe.sumelectthermalfe: -834.139893 hartree
dipole: -6.4527 6.5402 -0.5555
dipole: 9.2044
quadrupole: -95.5849 -112.8500 -101.2265
quadrupole: -5.6564 0.3016 -2.3120
quadrupole: 7.6356 -9.6296 1.9940 -5.6564 0.3016 -2.3120
hfenergy: -834.3563783 hartree
pointgroup: C01 [X(C10H16N4O3)]
dipole: -2.5290701 -2.5147081 0.6274497 debye
polarizability: 214.7802202|9.4133153|157.3945052|-11.7208159|-12.8220367|91.5482789 unknown
InChI: InChI=1S/C10H16N4O3/c1-4-5-11-9(16)12-7-6-8(15)14(3)10(17)13(7)2/h6,11-12H,4-5H2,1-3H3
charge 0 multiplicity 1
33 atoms
O  3.629673 -1.98324 0.100967
O  2.781132 2.562181 -0.676857
O  -1.903868 1.604498 0.264817
N  1.417722 -1.21231 0.27067
N  3.208707 0.282469 -0.285747
N  -0.832341 -0.505588 0.464122
N  -3.15702 -0.319944 0.686375
C  0.500023 -0.143353 0.199474
C  2.813926 -1.016878 0.029222
C  -4.441821 0.405144 0.72009
C  0.922979 1.13507 -0.112621
C  -5.182862 0.422144 -0.638155
C  2.315781 1.421467 -0.381191
C  1.003389 -2.591407 0.592424
C  -1.9660 0.358395 0.451524
C  4.651466 0.492594 -0.536914
C  -5.586928 -0.980198 -1.141781
H  -4.215507 1.438568 1.032841
H  -5.079519 -0.059793 1.496539
H  0.208121 1.953333 -0.154862
H  -6.088096 1.049568 -0.519091
H  -4.541845 0.927673 -1.384468
H  -0.996985 -1.476968 0.729615
H  0.567121 -2.6604 1.607451
H  1.917146 -3.204862 0.571154
H  0.298821 -2.989928 -0.161908
H  -3.183077 -1.340007 0.713919
H  5.237982 0.201663 0.350018
H  4.784031 1.562245 -0.755948
H  4.983078 -0.121664 -1.390325
H  -6.233246 -1.499995 -0.408418
H  -6.146548 -0.913426 -2.091658
H  -4.699832 -1.614451 -1.330375
