program: Gaussian 09
title: 000208118
version: EM64L-G09RevD.01
frameworkgroup: C1[X(C11H18N4O3)]
method: RPBEPBE
basis: SDD
operation: Freq
keyword: #p
keyword: freq=noraman
keyword: PBEPBE/SDD
title: #p freq=noraman PBEPBE/SDD
converged: YES YES NO NO
title: Mulliken charges:
elementType: O O O N N N N C C C C C C C C C C C H H H H H H H H H H H H H H H H H H
charge: -0.282999 -0.265900 -0.266155 -0.253832 -0.205691 -0.413749 -0.500119 -0.332821 -0.390478 -0.351826 0.462843 0.232472 -0.390587 0.202569 0.316900 -0.682231 -0.678561 -0.602091 0.226695 0.200721 0.212343 0.262512 0.192227 0.187673 0.288791 0.322198 0.322691 0.216635 0.216874 0.212228 0.233903 0.307760 0.233540 0.245862 0.273912 0.245691
chargesum: 0.00000
title: Mulliken charges with hydrogens summed into heavy atoms:
elementType: O O O N N N N C C C C C C C C C C C
charge: -0.282999 -0.265900 -0.266155 -0.253832 -0.205691 -0.124958 -0.177428 0.094595 0.084376 0.028075 0.462843 0.232472 -0.068388 0.202569 0.316900 -0.036495 0.096642 0.163373
polarizability: 2.25979631e+02 -9.58193025e+00 1.67293616e+02 1.63211767e+01 -5.46552853e+00 1.04039068e+02
1716.lowfreq: -13.3220 -6.4378 -0.0004 0.0002 0.0006 3.1951 5.4072 23.9687 40.4786
frequency: -7.3691 23.6521 40.4587 60.4538 79.8679 85.1469 99.8881 109.6085 117.9585 135.9933 183.8420 210.3140 220.5881 235.0502 241.7339 249.3697 274.1249 308.5423 310.3269 324.7196 355.7950 383.2964 389.3669 406.8910 472.2442 500.7120 525.2724 540.9930 611.9406 634.6070 645.9427 684.2350 700.9451 709.5329 726.9392 727.4351 754.9969 828.6446 848.9456 856.0200 887.3524 915.9729 959.9690 972.9965 1003.2748 1039.2651 1050.3305 1098.0359 1117.9663 1121.3024 1131.6156 1135.7615 1168.8676 1181.0199 1204.0401 1227.7174 1231.9803 1244.5768 1257.5531 1260.3355 1285.6706 1308.6232 1332.7136 1347.2961 1354.9571 1366.9141 1394.9329 1423.1727 1434.2672 1449.3398 1459.6395 1473.0502 1475.3793 1477.4078 1478.9104 1479.2035 1486.0791 1488.8297 1509.0557 1513.8014 1577.1508 1634.1043 1652.6409 1668.4219 2954.0659 2967.3886 2977.4955 2981.5581 2996.9054 3000.7128 3009.5363 3047.2977 3050.6437 3074.3462 3077.3095 3082.2112 3101.2313 3106.3819 3136.3739 3234.1642 3546.6565 3555.8731
redmass: 4.2086 4.3661 5.3197 5.2916 1.6801 3.3576 3.5608 1.2516 2.6358 3.2877 3.4984 2.5036 3.4135 1.4201 2.8719 1.3083 2.9446 3.8406 3.3795 2.9570 1.6735 4.0086 3.6252 4.8253 7.0409 3.4072 3.7142 1.2644 4.8837 8.0284 6.0976 5.3364 4.5730 8.6295 3.1697 2.5808 1.8854 2.0935 1.7809 1.3803 2.8963 1.9301 2.2733 1.7121 2.4855 3.4363 2.7999 3.2671 2.0891 1.2886 1.3079 1.8942 2.4110 2.8215 2.0120 1.5377 2.5823 3.3012 2.1695 1.4469 1.1017 1.2580 3.0424 1.5358 2.4158 1.4290 1.2109 1.3168 1.2766 1.1085 1.0814 1.0825 1.0858 1.0456 1.0710 1.1395 1.0968 1.5008 1.0473 2.4383 6.8723 8.5090 4.9868 6.8799 1.0588 1.0362 1.0368 1.0603 1.0736 1.0915 1.0328 1.1007 1.1035 1.1005 1.0997 1.0999 1.1022 1.0953 1.1021 1.0932 1.0768 1.0761
irintensity: 1.2743 0.1272 5.3975 5.2118 0.1235 1.6668 0.3005 2.9920 8.6487 3.3262 0.3853 1.2001 2.9426 1.5939 1.1172 0.6116 0.9492 3.9115 1.4199 6.8470 21.6594 17.5885 1.3183 26.2113 8.6815 10.2800 16.3487 191.8337 7.9666 0.0390 7.1672 0.4034 2.8592 13.9894 16.8469 8.9351 7.6978 1.1228 3.8656 51.1317 8.0553 4.5819 49.7914 18.0220 3.5363 9.0595 1.1423 0.8377 3.0940 0.0792 0.1423 5.6336 65.5912 142.3424 231.0978 3.5276 117.8564 25.1265 97.5504 24.0679 0.3489 36.5807 114.9659 1.6047 11.6904 0.6426 9.3081 87.8346 64.7086 41.0058 5.9637 50.7527 62.6620 22.5398 26.1514 224.3599 22.5814 380.6459 23.3386 596.4808 187.3624 152.9900 349.7460 490.0139 34.3623 57.4441 27.2330 43.2406 49.6683 3.5344 31.8654 48.9292 25.9231 72.5877 43.0811 12.2041 19.4015 2.6634 0.9246 24.4939 9.7881 34.3518
temp: 298.150 k
press: 1.00000 atm
elementType: 8 8 8 7 7 7 7 6 6 6 6 6 6 6 6 6 6 6 1 1 1 1 1 1 1 1 1 1 1 1 1 1 1 1 1 1
symmnumber: 1
zpe: 770383.4 jmol-1
zpe.correction: 0.293424 hartree
zpe.thermalcorrener: 0.312108 hartree
zpe.thermalcorrenthalpy: 0.313053 hartree
zpe.thermalcorrgfe: 0.245609 hartree
zpe.sumelectzpe: -873.313756 hartree
zpe.sumelectthermal: -873.295071 hartree
zpe.sumelectthermalent: -873.294127 hartree
zpe.sumelectthermalfe: -873.361571 hartree
dipole: -6.5450 6.4036 -1.3744
dipole: 9.2591
quadrupole: -106.6132 -120.1215 -107.0590
quadrupole: -2.6817 1.2053 -2.9209
quadrupole: 4.6514 -8.8570 4.2056 -2.6817 1.2053 -2.9209
hfenergy: -873.6071793 hartree
pointgroup: C01 [X(C11H18N4O3)]
dipole: -2.5069904 2.5796271 0.5750088 debye
polarizability: 225.659614|-16.4337113|161.6853598|9.239667|19.8254616|109.9673407 unknown
InChI: InChI=1S/C11H18N4O3/c1-4-5-6-12-10(17)13-8-7-9(16)15(3)11(18)14(8)2/h7,12-13H,4-6H2,1-3H3
charge 0 multiplicity 1
36 atoms
O  4.003059 1.622437 0.922654
O  3.118648 -2.682915 -0.710302
O  -1.495381 -1.239087 -1.336294
N  1.812579 1.108752 0.248897
N  3.563862 -0.523799 0.109674
N  -2.721217 0.680948 -0.824899
N  -0.415267 0.662729 -0.411199
C  -4.821197 -0.551511 -0.132917
C  -4.002712 0.099581 -1.272026
C  -5.285293 0.441641 0.956489
C  0.896077 0.174283 -0.277119
C  3.18804 0.773896 0.453103
C  1.300377 -1.104453 -0.61234
C  2.671224 -1.530816 -0.43135
C  -1.546722 -0.060546 -0.889217
C  -6.130042 -0.237056 2.056251
C  1.417087 2.480014 0.62358
C  4.98519 -0.877589 0.318325
H  -4.217403 -1.3603 0.322279
H  -5.709358 -1.036067 -0.586901
H  -4.593023 0.899849 -1.7588
H  -3.756364 -0.658902 -2.034204
H  -5.876035 1.254716 0.484834
H  -4.400336 0.920987 1.424461
H  -2.746188 1.583682 -0.348923
H  0.587538 -1.813506 -1.026615
H  -0.56381 1.643106 -0.170287
H  -5.551264 -1.028513 2.56767
H  -6.459947 0.489546 2.820851
H  -7.032989 -0.708842 1.625531
H  1.059819 3.054912 -0.252277
H  2.32321 2.972067 1.00894
H  0.654405 2.477502 1.425141
H  5.633642 -0.215817 -0.279232
H  5.102433 -1.924187 0.001194
H  5.254458 -0.761141 1.38102
