program: Gaussian 09
title: 000208099
version: EM64L-G09RevD.01
frameworkgroup: C1[X(C22H27NO)]
method: RPBEPBE
basis: SDD
operation: Freq
keyword: #p
keyword: freq=noraman
keyword: PBEPBE/SDD
title: #p freq=noraman PBEPBE/SDD
converged: NO YES NO NO
title: Mulliken charges:
elementType: O N C C C C C C C C C C C C C C C C C C C C C C H H H H H H H H H H H H H H H H H H H H H H H H H H H
charge: -0.309861 -0.060485 -0.151114 -0.135532 -0.484383 -0.484792 -0.467851 -0.508037 0.051275 -0.647541 -0.280039 0.271572 0.488658 0.288872 -0.401093 -0.440339 -0.370124 -0.419114 -0.851893 -0.247212 -0.235332 -0.228109 -0.238381 -0.243408 0.226499 0.231542 0.216095 0.230181 0.229813 0.217373 0.188889 0.233544 0.232747 0.208975 0.220874 0.193909 0.227192 0.227591 0.196154 0.284683 0.226267 0.255653 0.226360 0.227206 0.255316 0.219745 0.224003 0.226382 0.225891 0.223065 0.228311
chargesum: 0.00000
title: Mulliken charges with hydrogens summed into heavy atoms:
elementType: O N C C C C C C C C C C C C C C C C C C C C C C
charge: -0.309861 -0.060485 0.075385 0.096010 -0.038108 -0.037606 -0.045418 -0.066315 0.272149 0.001152 -0.083885 0.271572 0.488658 0.288872 -0.116410 -0.214072 -0.114471 -0.192753 -0.149626 -0.023209 -0.008951 -0.002218 -0.015316 -0.015096
polarizability: 2.55650811e+02 -1.70539589e+01 2.40208062e+02 -5.59956374e+00 1.57608293e+01 2.10185368e+02
1716.lowfreq: -11.7780 -4.1024 0.0007 0.0008 0.0009 4.1968 14.8292 26.2952 34.7367
frequency: 13.4446 26.2848 34.7004 42.8135 54.8955 63.4574 95.0854 140.9842 150.8408 159.1953 170.1850 184.5214 193.5309 208.1077 217.1219 249.5720 278.0977 281.9705 293.5038 350.1303 360.9592 374.3824 402.8791 418.6488 439.8817 451.3266 477.0565 495.7407 501.9521 524.0826 558.8689 601.0986 610.2981 616.6314 645.4101 694.8102 705.9236 728.6528 738.7299 754.9228 759.6045 773.6536 782.2345 793.8810 817.4138 821.3201 835.7844 855.4089 864.3813 866.2488 884.0729 903.9402 925.9552 942.2660 959.4193 959.8440 976.9821 977.9530 980.5488 987.4529 990.6542 994.7547 996.9656 1009.1138 1025.0955 1040.0410 1043.3653 1044.7020 1048.4227 1069.3623 1080.7784 1103.5378 1105.3398 1112.2893 1126.7842 1145.8186 1155.3855 1170.9706 1172.6311 1176.4522 1186.3262 1192.5016 1193.9201 1202.0866 1225.0264 1231.7208 1242.5229 1250.8052 1263.3102 1270.7872 1284.5071 1286.3334 1293.4609 1307.0577 1315.1029 1324.4206 1334.6287 1348.2022 1354.3751 1366.5874 1378.6351 1385.4299 1400.8808 1424.6873 1433.0693 1441.3543 1447.6309 1458.6114 1461.6354 1463.3648 1469.3566 1477.0361 1478.9785 1480.0739 1483.4042 1484.2273 1586.9168 1592.7950 1608.2761 1614.7404 2880.9589 2943.4311 2961.8106 2968.3755 2987.0067 2999.5222 3001.7350 3012.5929 3022.8261 3035.6742 3044.3432 3046.7863 3052.3033 3059.3972 3070.3987 3077.9458 3078.2055 3082.4277 3106.5101 3116.0649 3124.4395 3130.6017 3135.7221 3147.2842 3152.0873 3162.4229 3173.3399
redmass: 3.5016 4.2277 3.8720 3.7024 4.9434 4.1022 4.0200 1.5785 2.4895 2.8731 2.2166 2.5053 1.0963 3.3608 3.1202 3.7474 2.9580 2.8182 4.1976 2.4577 2.5207 3.3395 2.8142 2.6448 3.4305 3.8675 3.0589 3.4390 3.5883 4.2760 3.7493 3.2825 5.2301 5.9973 5.3754 4.3812 1.6800 3.6597 4.4648 1.5096 2.0857 2.2035 2.0522 4.0007 2.5611 3.4313 2.3115 1.2529 2.2318 1.9485 1.3573 3.3456 1.8924 2.7952 1.9503 1.4584 1.6176 2.0368 1.7676 1.6147 5.6847 1.3313 1.3330 4.0324 2.2543 2.0768 1.7762 1.5834 2.0735 2.0295 1.6032 1.5818 2.0336 1.3441 2.1572 1.3050 1.9631 1.1733 1.0830 1.8931 1.1473 1.9928 1.4561 1.5610 1.4377 2.5097 1.6129 1.2875 1.5513 1.3632 1.4297 1.5046 1.5685 1.3421 1.3165 1.4400 1.2802 1.4421 1.4452 1.5560 3.6650 6.4972 1.2862 1.1712 2.1243 2.1148 1.0936 1.0917 1.0681 1.0635 1.0504 1.7441 2.2111 1.0499 1.1004 1.4343 6.5573 6.0640 6.0498 6.2598 1.0534 1.0822 1.0830 1.0385 1.0612 1.0591 1.0610 1.0632 1.0754 1.0871 1.0954 1.0885 1.1031 1.1011 1.1026 1.1036 1.1014 1.0982 1.0877 1.0860 1.0858 1.0900 1.0910 1.0955 1.0969 1.1013 1.0956
irintensity: 0.1779 0.3431 0.0332 0.0513 0.3333 0.2271 0.1715 1.3561 0.1887 0.0832 0.0919 0.1828 0.0203 0.0994 5.4152 5.2313 0.3328 0.8528 5.6580 1.0541 4.4595 1.5770 0.2585 3.6273 2.7497 3.4714 3.5607 2.0977 2.6866 0.4090 7.1935 8.9687 13.0504 7.4067 8.6968 5.9309 63.7741 4.4406 0.6595 76.8260 15.9790 4.5818 38.1116 2.9352 0.6135 0.3847 9.3483 0.1473 1.9536 1.7578 0.6931 2.6512 16.8044 2.7705 1.9395 1.6338 2.5754 4.3735 0.6660 2.0305 0.9902 0.5568 2.7778 155.5418 8.1078 63.1801 33.3225 9.9381 19.9316 23.0416 11.5446 6.7306 1.8019 1.0479 21.6460 3.0346 0.8039 2.0569 2.8182 7.8160 0.4151 3.3215 0.3814 9.2972 5.6907 4.7388 1.4615 2.7732 8.9601 0.4300 4.5801 16.7314 10.7936 0.3333 1.0240 25.6313 1.9641 16.1616 6.4483 8.3102 1.5167 0.9508 9.7634 4.0542 3.0058 9.1521 5.8963 7.2779 12.0792 13.2602 10.3712 21.2595 10.2894 2.1664 31.1580 24.6160 0.4745 0.5828 1.8829 2.8663 115.5252 26.7465 29.3626 26.9082 38.5181 18.0705 21.6492 40.0312 53.4537 75.2058 18.2695 17.3670 6.4758 14.4223 28.8283 77.1286 44.4670 27.6036 11.5968 5.7121 0.0588 21.6675 16.3824 27.9088 38.9526 25.8643 10.8992
temp: 298.150 k
press: 1.00000 atm
elementType: 8 7 6 6 6 6 6 6 6 6 6 6 6 6 6 6 6 6 6 6 6 6 6 6 1 1 1 1 1 1 1 1 1 1 1 1 1 1 1 1 1 1 1 1 1 1 1 1 1 1 1
symmnumber: 1
zpe: 1143692.9 jmol-1
zpe.correction: 0.435610 hartree
zpe.thermalcorrener: 0.457411 hartree
zpe.thermalcorrenthalpy: 0.458355 hartree
zpe.thermalcorrgfe: 0.382949 hartree
zpe.sumelectzpe: -982.722276 hartree
zpe.sumelectthermal: -982.700475 hartree
zpe.sumelectthermalent: -982.699531 hartree
zpe.sumelectthermalfe: -982.774937 hartree
dipole: -1.5457 2.3889 0.7347
dipole: 2.9387
quadrupole: -133.8278 -143.3978 -134.8550
quadrupole: -1.4121 0.2064 2.5190
quadrupole: 3.5324 -6.0376 2.5052 -1.4121 0.2064 2.5190
hfenergy: -983.157886 hartree
pointgroup: C01 [X(C22H27N1O1)]
dipole: -0.525823 0.7704128 0.683132 debye
polarizability: 252.4001496|-16.2914534|224.5483166|-10.1392223|22.6632441|229.0957746 unknown
InChI: InChI=1S/C22H27NO/c1-16-8-6-7-11-21(16)22(17-9-4-3-5-10-17)24-20-14-18-12-13-19(15-20)23(18)2/h3-11,18-20,22H,12-15H2,1-2H3
charge 0 multiplicity 1
51 atoms
O  -0.228402 -0.674261 -0.716122
N  -4.353263 -1.001651 -0.369862
C  -3.716459 -0.610261 0.929253
C  -3.891811 0.10902 -1.266454
C  -3.974872 0.93903 1.060307
C  -4.094442 1.424822 -0.424411
C  -2.20441 -0.941042 0.827652
C  -2.400067 -0.146239 -1.593764
C  -1.542727 -0.126268 -0.312758
C  -5.826479 -1.138474 -0.294967
C  0.851024 -0.565113 0.290455
C  2.074349 -1.272637 -0.29588
C  1.123259 0.904364 0.646635
C  3.15596 -1.663138 0.55107
C  2.14351 -1.530448 -1.686191
C  0.777544 1.412263 1.922502
C  1.687313 1.784096 -0.312154
C  4.280982 -2.295887 -0.03457
C  3.128702 -1.420535 2.051135
C  3.27297 -2.161103 -2.252613
C  0.990933 2.773184 2.242354
C  1.898293 3.143735 0.001201
C  4.350023 -2.544314 -1.423715
C  1.551788 3.643291 1.280269
H  -4.167846 -1.184141 1.757844
H  -4.482758 0.109625 -2.199086
H  -3.158354 1.446169 1.605107
H  -4.90952 1.130287 1.617278
H  -5.088728 1.86426 -0.620125
H  -3.34002 2.190286 -0.678952
H  -1.713993 -0.72935 1.798106
H  -2.094845 -2.018617 0.606513
H  -2.307331 -1.141116 -2.064981
H  -2.019609 0.610235 -2.305455
H  -1.398874 0.922437 0.022474
H  -6.366584 -0.226045 0.056555
H  -6.077739 -1.967402 0.390706
H  -6.215314 -1.399394 -1.295432
H  0.537486 -1.092181 1.217936
H  1.289316 -1.248421 -2.307243
H  0.343209 0.737489 2.67229
H  1.96184 1.393709 -1.298387
H  5.112991 -2.599813 0.612567
H  4.036146 -1.824374 2.531366
H  3.0700 -0.34176 2.287766
H  2.253687 -1.902928 2.529754
H  3.307591 -2.355922 -3.330513
H  0.722164 3.151768 3.235107
H  2.337507 3.814534 -0.746058
H  5.231598 -3.036469 -1.850203
H  1.720764 4.698399 1.523587
