program: Gaussian 09
title: 000208083
version: EM64L-G09RevD.01
frameworkgroup: C1[X(C10H17NOS)]
method: RPBEPBE
basis: SDD
operation: Freq
keyword: #p
keyword: freq=noraman
keyword: PBEPBE/SDD
title: #p freq=noraman PBEPBE/SDD
converged: YES YES NO NO
title: Mulliken charges:
elementType: S O N C C C C C C C C C C H H H H H H H H H H H H H H H H H
charge: 0.270615 -0.462287 -0.410847 -0.117684 -0.200562 -0.056786 -0.741242 0.646041 -0.691979 -0.671418 -0.253995 -0.825358 -0.549758 0.243315 0.186343 0.222949 0.264060 0.251154 0.205849 0.231900 0.214608 0.200528 0.234764 0.224089 0.215196 0.202828 0.270506 0.362270 0.273251 0.261651
chargesum: 0.00000
title: Mulliken charges with hydrogens summed into heavy atoms:
elementType: S O N C C C C C C C C C C
charge: 0.270615 -0.100016 -0.146787 0.125631 -0.014219 0.166162 -0.052340 0.646041 -0.042079 -0.029305 0.016511 -0.552108 -0.288107
polarizability: 1.72328159e+02 9.37569532e+00 1.13907742e+02 6.32966348e+00 -1.34971476e+01 1.09556764e+02
1716.lowfreq: -10.3925 -8.1740 -0.0028 -0.0026 -0.0011 3.2237 23.9282 34.9157 52.2419
frequency: 23.8091 34.5949 52.1025 77.0827 94.2093 177.7264 189.8345 212.9907 224.7451 241.4707 255.5635 276.6914 310.6111 355.5781 366.9326 412.8995 440.6399 457.6246 486.4770 536.4165 603.8519 642.1352 661.6392 688.4436 700.2378 770.3522 777.3123 803.4411 827.8261 836.4799 868.0369 887.4125 898.9507 914.9097 932.0712 937.2261 975.6073 1021.9130 1065.2648 1079.7062 1081.8921 1127.6261 1142.1275 1154.9383 1171.7125 1177.4578 1213.1492 1252.2673 1280.7594 1296.7211 1312.2476 1323.0241 1356.3141 1376.2780 1379.5628 1388.2584 1393.4721 1407.9156 1435.6321 1461.1268 1462.6774 1464.3647 1470.3055 1478.3915 1481.7241 1486.1958 1553.7440 2909.8105 2970.6953 2973.4505 2976.4505 2990.1909 3008.9577 3064.8893 3067.0614 3074.3003 3077.2809 3085.1720 3089.7916 3094.8101 3184.4946 3220.8253 3237.8258 3428.6109
redmass: 3.9508 4.2119 2.9372 4.3042 4.0949 3.1633 3.5957 1.0922 2.0656 1.0665 3.1370 1.5321 3.0489 4.7919 2.5021 2.1171 3.9733 2.4496 3.0192 3.5560 8.5395 2.5543 2.2968 1.2428 3.7859 3.1088 1.6880 4.8690 1.3591 1.9164 1.5315 1.8435 1.3727 1.2301 3.2503 1.4008 1.9831 4.8344 2.1595 2.2179 1.0970 2.3652 2.1905 1.3966 2.0301 1.9230 1.6109 1.3881 1.3194 1.2496 1.2373 1.3455 1.2311 1.2448 1.8904 1.2534 1.2283 1.8184 1.1949 3.1310 1.1938 1.0811 1.0632 1.0495 1.0698 1.0498 6.2297 1.0837 1.0357 1.0379 1.0395 1.0826 1.0849 1.0991 1.0972 1.0979 1.0987 1.0927 1.0789 1.0901 1.0915 1.0953 1.1007 1.0739
irintensity: 0.1046 0.2780 0.0445 2.5585 2.4048 2.7703 3.5050 1.1017 2.7993 0.3517 3.4371 0.7891 7.0143 2.3588 2.0196 5.0169 1.1593 1.1564 0.7887 5.0869 6.9134 40.8886 17.1876 2.0493 1.3066 19.9636 85.3428 35.3728 88.7659 54.4446 45.4907 7.2277 2.8921 5.1856 11.2614 1.4091 6.4051 34.9125 9.2152 35.8781 9.4910 60.3411 43.8137 17.4637 64.8994 6.6124 11.8540 6.2227 12.0674 40.8820 12.5972 7.7382 3.6007 27.4911 9.9046 26.0428 24.7847 79.5932 17.4035 14.7827 8.3550 9.2150 4.8843 4.1535 10.3758 19.7123 0.5160 58.3601 21.1125 25.9957 26.1874 8.6145 17.5768 8.8236 29.0514 76.2426 34.3741 23.0230 324.0420 32.4271 0.6099 1.1102 0.5878 0.0215
temp: 298.150 k
press: 1.00000 atm
elementType: 16 8 7 6 6 6 6 6 6 6 6 6 6 1 1 1 1 1 1 1 1 1 1 1 1 1 1 1 1 1
symmnumber: 1
zpe: 662164.9 jmol-1
zpe.correction: 0.252205 hartree
zpe.thermalcorrener: 0.266970 hartree
zpe.thermalcorrenthalpy: 0.267915 hartree
zpe.thermalcorrgfe: 0.209154 hartree
zpe.sumelectzpe: -918.243659 hartree
zpe.sumelectthermal: -918.228894 hartree
zpe.sumelectthermalent: -918.227950 hartree
zpe.sumelectthermalfe: -918.286710 hartree
dipole: -3.4873 2.5216 1.2043
dipole: 4.4688
quadrupole: -82.6517 -90.5627 -85.7065
quadrupole: -0.1680 1.8594 -8.8218
quadrupole: 3.6553 -4.2557 0.6005 -0.1680 1.8594 -8.8218
hfenergy: -918.4958642 hartree
pointgroup: C01 [X(C10H17N1O1S1)]
dipole: -1.5422347 0.3235695 -0.7796775 debye
polarizability: 166.4976045|9.9814397|112.6387842|-20.0407971|11.7212424|116.6562757 unknown
InChI: InChI=1S/C10H17NOS/c1-7(2)11-8(3)10(12)9-4-5-13-6-9/h4-8,10-12H,1-3H3
charge 0 multiplicity 1
30 atoms
S  4.086068 0.607038 -1.137603
O  0.206207 -0.875068 1.61184
N  -1.996124 -0.471561 0.283472
C  -0.78232 -0.107963 -0.504698
C  0.452334 -0.836136 0.175359
C  -2.919798 0.623125 0.707724
C  -0.876936 -0.455235 -2.0023
C  1.757767 -0.122384 -0.097689
C  -3.968414 0.037024 1.675354
C  -3.600788 1.361531 -0.473556
C  2.154606 1.085092 0.600035
C  2.683505 -0.511257 -1.053519
C  3.362406 1.604319 0.172872
H  -0.625654 0.981114 -0.381736
H  0.500158 -1.869913 -0.239413
H  -2.296989 1.352143 1.263253
H  -2.512695 -1.257656 -0.137026
H  0.075268 -0.227237 -2.51421
H  -1.081457 -1.535419 -2.139312
H  -1.681824 0.112836 -2.500819
H  -4.637466 0.829852 2.054128
H  -4.598029 -0.716318 1.162283
H  -3.479138 -0.451445 2.536111
H  -2.85384 1.792667 -1.164229
H  -4.234511 2.188779 -0.102909
H  -4.245503 0.66847 -1.047749
H  1.565182 1.504422 1.418316
H  -0.812823 -0.903067 1.633139
H  2.665229 -1.38284 -1.706753
H  3.900978 2.481586 0.526436
