program: Gaussian 09
title: 000208081
version: EM64L-G09RevD.01
frameworkgroup: C1[X(C11H19NOS)]
method: RPBEPBE
basis: SDD
operation: Freq
keyword: #p
keyword: freq=noraman
keyword: PBEPBE/SDD
title: #p freq=noraman PBEPBE/SDD
converged: YES YES NO NO
title: Mulliken charges:
elementType: S O N C C C C C C C C C C C H H H H H H H H H H H H H H H H H H H
charge: 0.245701 -0.460572 -0.342430 -0.013882 -0.016255 -0.175486 -0.385525 -0.736595 -0.712461 -0.144987 -0.690601 -0.303163 -0.130196 -0.513734 0.203185 0.191187 0.226495 0.272721 0.186838 0.191805 0.244393 0.222903 0.221607 0.217579 0.207031 0.212006 0.200566 0.241993 0.205556 0.349512 0.275024 0.244861 0.264924
chargesum: 0.00000
title: Mulliken charges with hydrogens summed into heavy atoms:
elementType: S O N C C C C C C C C C C C
charge: 0.245701 -0.111060 -0.069709 0.189303 0.174932 0.051008 -0.006882 -0.047692 -0.075845 -0.144987 -0.042486 -0.028139 0.114665 -0.248810
polarizability: 1.88266733e+02 9.86334010e-01 1.38177239e+02 -1.12903190e+01 1.75133892e+00 1.07251310e+02
1716.lowfreq: -12.7233 -0.0027 -0.0024 -0.0022 4.7622 8.6249 22.0308 35.9345 43.9497
frequency: 20.2143 35.7907 43.8671 67.9476 89.1035 105.7363 137.9050 182.4468 192.1613 206.7469 213.9915 221.5854 258.2043 290.7027 303.6435 335.0393 369.4530 372.9517 425.0130 458.0883 479.8665 508.3626 538.4570 578.8465 596.7290 688.2693 696.8631 701.2235 771.9075 785.8821 819.3465 828.3368 839.8426 861.5984 895.1235 913.1047 925.5912 952.5349 969.2091 1006.7086 1021.9481 1033.4291 1062.4067 1078.6570 1090.7456 1103.7161 1125.7320 1146.2319 1178.0305 1182.4240 1215.0596 1234.0892 1253.6831 1291.7698 1295.3213 1301.4486 1319.2144 1335.1522 1339.0407 1344.4746 1356.3037 1376.9880 1380.9418 1386.4553 1451.7891 1462.5083 1468.3416 1469.9791 1471.2342 1474.0003 1480.2762 1485.3656 1489.7806 1547.8740 2865.8768 2958.1189 2966.3460 2969.6153 2976.1924 2984.0060 2989.5549 3020.7283 3063.2871 3066.2849 3067.3998 3084.1015 3090.2581 3092.8789 3170.1527 3188.1385 3237.4842 3418.2973 3568.7031
redmass: 3.4513 4.7089 4.0057 4.3295 2.4661 2.5490 2.2835 4.2984 2.0956 1.3795 1.3477 1.3835 2.1324 1.3803 2.7555 2.8050 2.6679 2.6231 3.1290 3.6754 2.2067 4.3644 2.8910 7.6359 3.3893 4.0460 1.7204 1.5314 2.0778 1.4818 3.2341 2.1059 1.3139 1.8264 1.9434 1.3839 3.4504 2.1960 1.2823 1.5585 1.8630 3.1489 1.5815 1.3578 1.6420 2.3107 1.7971 2.2461 2.5699 2.0126 1.4941 1.3451 1.2449 1.2373 1.3167 1.4924 1.4912 1.4212 1.4498 1.7584 1.4829 1.2093 1.2176 1.2158 1.1425 1.0664 1.0462 1.5092 2.3209 1.0672 1.0989 1.0703 1.0563 5.8193 1.0799 1.0614 1.0384 1.0828 1.0372 1.0705 1.0469 1.0979 1.0996 1.0990 1.0994 1.0991 1.0994 1.0993 1.0896 1.0978 1.1002 1.0733 1.0663
irintensity: 0.2167 0.3078 0.4140 0.8326 0.3845 0.6102 0.2958 0.6177 0.6618 0.1007 1.0132 0.1973 1.0892 89.4732 3.7084 60.6821 2.0120 2.8433 2.8971 8.1271 1.5457 1.7322 18.1071 7.5695 4.8071 31.0930 88.8162 46.1702 46.3461 3.5368 3.0393 11.0458 23.3253 4.0976 3.4239 3.2960 43.3343 58.4665 10.8674 23.2024 9.1964 5.1491 5.9244 7.7420 9.8768 17.8766 24.7922 17.7225 70.2349 1.2909 23.4779 34.6048 7.2268 6.3213 21.9148 15.2518 4.2547 1.5984 9.9523 2.6481 10.0957 11.3703 27.7209 20.6861 49.7948 18.3455 8.4772 7.1647 9.0199 0.8668 16.9688 23.1563 10.4133 1.2740 64.1585 20.5225 30.2313 40.9507 35.7259 9.5336 41.1115 32.4071 24.4265 45.4935 92.3114 30.8486 48.5099 30.6326 7.5129 1.7079 0.7267 7.5986 6.3453
temp: 298.150 k
press: 1.00000 atm
elementType: 16 8 7 6 6 6 6 6 6 6 6 6 6 6 1 1 1 1 1 1 1 1 1 1 1 1 1 1 1 1 1 1 1
symmnumber: 1
zpe: 734030.0 jmol-1
zpe.correction: 0.279577 hartree
zpe.thermalcorrener: 0.296171 hartree
zpe.thermalcorrenthalpy: 0.297115 hartree
zpe.thermalcorrgfe: 0.234059 hartree
zpe.sumelectzpe: -957.460773 hartree
zpe.sumelectthermal: -957.444180 hartree
zpe.sumelectthermalent: -957.443236 hartree
zpe.sumelectthermalfe: -957.506291 hartree
dipole: 1.4767 0.8157 -0.0645
dipole: 1.6883
quadrupole: -86.3660 -94.3100 -92.6140
quadrupole: 0.2573 1.0521 -0.6202
quadrupole: 4.7307 -3.2133 -1.5173 0.2573 1.0521 -0.6202
hfenergy: -957.7403503 hartree
pointgroup: C01 [X(C11H19N1O1S1)]
dipole: -0.600347 -0.2690403 0.0915758 debye
polarizability: 188.0426214|2.8323021|130.9893981|11.5264567|-13.3323358|114.6632624 unknown
InChI: InChI=1S/C11H19NOS/c1-4-8(2)12-9(3)11(13)10-6-5-7-14-10/h5-9,11-13H,4H2,1-3H3
charge 0 multiplicity 1
33 atoms
S  -3.019316 1.422039 -0.810373
O  -0.30623 0.397006 1.938236
N  1.798109 0.124603 0.225459
C  0.45883 -0.307554 -0.233071
C  2.991671 -0.624793 -0.243929
C  -0.570651 0.605049 0.48937
C  4.26378 0.126808 0.226868
C  0.319458 -0.19136 -1.763592
C  3.023264 -2.109425 0.215527
C  -2.008079 0.282333 0.1698
C  4.415342 1.525989 -0.404534
C  -2.750892 -0.832363 0.539282
C  -4.111913 -0.8166 0.059112
C  -4.423339 0.313152 -0.680837
H  0.208805 -1.355622 0.06931
H  2.985409 -0.603243 -1.352308
H  -0.334494 1.655446 0.214937
H  1.795548 0.215545 1.25277
H  4.232993 0.214489 1.333977
H  5.149377 -0.495298 -0.011534
H  -0.705427 -0.444784 -2.084653
H  0.557187 0.836492 -2.093958
H  1.011233 -0.882352 -2.276019
H  2.111867 -2.650997 -0.098746
H  3.092759 -2.173275 1.318791
H  3.894689 -2.638906 -0.21421
H  4.555423 1.451309 -1.499891
H  3.50456 2.121937 -0.221546
H  5.285387 2.066039 0.01273
H  -0.98751 0.894237 2.457175
H  -2.328463 -1.635173 1.148133
H  -4.832303 -1.614209 0.256735
H  -5.360474 0.585281 -1.163113
