program: Gaussian 09
title: 000208077
version: EM64L-G09RevD.01
frameworkgroup: C1[X(C11H19NOS)]
method: RPBEPBE
basis: SDD
operation: Freq
keyword: #p
keyword: freq=noraman
keyword: PBEPBE/SDD
title: #p freq=noraman PBEPBE/SDD
converged: YES YES NO NO
title: Mulliken charges:
elementType: S O N C C C C C C C C C C C H H H H H H H H H H H H H H H H H H H
charge: 0.245572 -0.434798 -0.355997 -0.056798 -0.365119 -0.129182 -0.060442 -0.744782 -0.128017 -0.692122 -0.699463 -0.284365 -0.146261 -0.518972 0.220260 0.190403 0.203678 0.217130 0.187658 0.256350 0.219195 0.237206 0.220690 0.196447 0.212641 0.235224 0.205645 0.217649 0.212194 0.291142 0.341527 0.242736 0.262971
chargesum: 0.00000
title: Mulliken charges with hydrogens summed into heavy atoms:
elementType: S O N C C C C C C C C C C C
charge: 0.245572 -0.093271 -0.099647 0.163462 0.028962 0.087948 0.127216 -0.067691 -0.128017 -0.047810 -0.063975 0.006777 0.096475 -0.256001
polarizability: 1.75142236e+02 3.88271820e+00 1.54297955e+02 1.63339480e+00 3.13718175e+00 1.00153190e+02
1716.lowfreq: -7.9856 -0.0002 0.0007 0.0024 6.9718 9.3008 17.2010 24.0632 41.3523
frequency: 12.1196 23.5008 41.0117 62.7950 103.4714 108.8102 133.3071 163.5658 205.5685 210.0240 228.4065 247.1756 253.7435 264.3680 312.9048 340.3788 361.9254 410.8146 427.7822 440.5160 485.7858 517.8511 573.2019 602.4552 648.7886 692.0307 698.2017 742.0158 762.5600 809.5909 822.3132 844.4488 847.7498 902.2837 913.2396 917.8855 921.2338 937.6213 951.3880 963.4869 1025.8284 1030.6533 1069.5344 1075.5630 1096.4632 1120.7901 1130.4532 1137.5608 1181.7543 1193.3434 1210.4413 1232.9577 1243.4250 1283.5700 1290.5769 1319.9069 1327.0498 1336.4184 1349.2249 1366.9052 1372.4503 1376.2324 1382.5503 1394.4825 1442.2415 1465.9229 1468.9738 1469.6506 1471.5199 1478.3901 1480.5901 1484.0242 1491.8926 1545.6661 2873.2884 2946.3776 2969.2235 2971.2845 2971.7386 2994.9736 3018.1331 3044.8361 3059.9631 3066.6248 3069.0867 3074.3797 3075.1424 3083.4592 3170.6799 3191.9695 3235.9640 3410.1113 3504.9756
redmass: 5.0795 3.1642 3.5534 3.5211 2.7502 3.3784 3.0700 3.8715 1.6063 1.9384 2.4745 1.9398 1.2927 1.2779 3.3662 3.8733 2.4174 2.1300 2.0389 2.3131 1.9366 3.6899 5.4509 4.7099 3.3533 5.1306 1.2418 2.0714 2.6307 3.2070 3.0766 1.3042 2.9527 1.9879 1.3838 1.2497 1.3544 1.8565 1.6073 1.6570 2.1208 2.0716 1.9698 1.3448 1.7852 2.0306 2.3458 2.2184 1.7971 2.1203 1.5339 1.4044 1.3235 1.2236 1.2809 1.6247 1.6147 1.4360 1.5931 1.3253 1.2149 1.2654 1.2119 1.2308 1.1935 1.0577 1.1184 4.7852 1.0561 1.0603 1.0494 1.0780 1.0556 5.7934 1.0694 1.0824 1.0360 1.0356 1.0359 1.0907 1.0852 1.0860 1.0987 1.0987 1.0987 1.0992 1.1000 1.0993 1.0898 1.0971 1.1001 1.0734 1.0648
irintensity: 0.2822 4.6675 1.2155 2.2639 2.2619 1.7527 9.7143 0.0942 0.8731 0.0596 0.4073 7.6269 3.7836 0.4079 0.8805 3.3241 18.1359 30.3206 48.3276 15.5533 85.3744 35.7295 1.1624 8.1488 25.3936 8.9971 94.4971 45.7798 18.2656 13.7427 8.3397 13.3437 19.8138 51.8121 0.9899 2.7953 12.7544 18.3671 9.2322 5.0343 4.6107 21.8386 16.9207 3.0952 6.9461 22.4228 67.5901 6.8396 8.0066 13.6470 22.9034 43.3176 7.4140 0.5380 2.2226 0.3148 2.4901 1.4582 7.9121 11.2077 18.0959 23.4280 24.2255 11.5581 29.6321 4.8263 0.9311 7.9800 5.6489 4.2073 14.4801 5.1931 28.8152 0.5679 98.8498 17.5222 34.6932 41.0123 18.8938 35.5364 17.0740 15.4011 15.1629 74.0901 51.8756 33.6736 35.2375 42.3971 5.7872 1.3219 1.0392 0.4272 9.3122
temp: 298.150 k
press: 1.00000 atm
elementType: 16 8 7 6 6 6 6 6 6 6 6 6 6 6 1 1 1 1 1 1 1 1 1 1 1 1 1 1 1 1 1 1 1
symmnumber: 1
zpe: 735616.9 jmol-1
zpe.correction: 0.280182 hartree
zpe.thermalcorrener: 0.296656 hartree
zpe.thermalcorrenthalpy: 0.297601 hartree
zpe.thermalcorrgfe: 0.233860 hartree
zpe.sumelectzpe: -957.458411 hartree
zpe.sumelectthermal: -957.441936 hartree
zpe.sumelectthermalent: -957.440992 hartree
zpe.sumelectthermalfe: -957.504732 hartree
dipole: 2.5275 -0.9151 -1.4659
dipole: 3.0618
quadrupole: -90.6820 -91.3459 -97.7008
quadrupole: 5.1485 3.9112 -2.9545
quadrupole: 2.5609 1.8970 -4.4579 5.1485 3.9112 -2.9545
hfenergy: -957.7385922 hartree
pointgroup: C01 [X(C11H19N1O1S1)]
dipole: -0.9589109 -0.409504 -0.6032291 debye
polarizability: 174.8346733|5.3251266|109.8818576|-2.2707841|-20.8683943|144.87685 unknown
InChI: InChI=1S/C11H19NOS/c1-8(2)7-12-9(3)11(13)10-5-4-6-14-10/h4-6,8-9,11-13H,7H2,1-3H3
charge 0 multiplicity 1
33 atoms
S  3.605511 0.122097 -0.014394
O  0.803488 0.72752 2.187552
N  -1.309926 -0.28846 0.724323
C  -0.207423 -1.238345 1.051069
C  -2.374858 -0.820252 -0.162097
C  1.105492 -0.426778 1.303091
C  -3.442896 0.253815 -0.487044
C  -0.526921 -2.129953 2.275362
C  1.795121 0.013277 0.033738
C  -2.843268 1.42107 -1.304143
C  -4.639898 -0.388845 -1.225487
C  1.255047 0.444991 -1.172827
C  2.237895 0.848928 -2.148558
C  3.543443 0.737387 -1.695935
H  -0.048916 -1.879923 0.163833
H  -2.886816 -1.714141 0.27254
H  -1.900873 -1.152417 -1.108249
H  1.791162 -1.039386 1.914867
H  -3.81478 0.66101 0.479293
H  -1.719354 0.083803 1.594899
H  0.243272 -2.910371 2.420502
H  -0.563134 -1.512599 3.192764
H  -1.501976 -2.636782 2.15131
H  -2.5346 1.070376 -2.308784
H  -3.582745 2.231121 -1.443853
H  -1.955404 1.839762 -0.798563
H  -4.313117 -0.840297 -2.182287
H  -5.411113 0.367799 -1.458656
H  -5.113569 -1.183403 -0.618787
H  0.176122 0.481721 -1.337702
H  0.247421 1.342849 1.637583
H  1.9843 1.208606 -3.148908
H  4.473316 0.96452 -2.214352
