program: Gaussian 09
title: 000208048
version: EM64L-G09RevD.01
frameworkgroup: C1[X(C12H14F3NO)]
method: RPBEPBE
basis: SDD
operation: Freq
keyword: #p
keyword: freq=noraman
keyword: PBEPBE/SDD
title: #p freq=noraman PBEPBE/SDD
converged: YES YES NO NO
title: Mulliken charges:
elementType: F F F O N C C C C C C C C C C C C H H H H H H H H H H H H H H
charge: -0.168491 -0.167413 -0.165669 -0.285950 -0.068410 -0.125295 -0.420223 -0.348960 -0.307692 0.443621 -0.616846 -0.489703 -0.416965 0.302473 -0.210278 -0.371390 0.239574 0.217596 0.208422 0.232361 0.213600 0.195772 0.220439 0.196256 0.193936 0.225701 0.226429 0.303411 0.241635 0.236147 0.265912
chargesum: 0.00000
title: Mulliken charges with hydrogens summed into heavy atoms:
elementType: F F F O N C C C C C C C C C C C C
charge: -0.168491 -0.167413 -0.165669 -0.285950 -0.068410 0.092300 0.020560 0.060412 0.109003 0.443621 0.029221 -0.186292 -0.175330 0.302473 0.025869 -0.105478 0.239574
polarizability: 1.77169974e+02 9.01738492e+00 1.41471592e+02 3.52605784e+00 -7.76071003e-01 9.50947609e+01
1716.lowfreq: -8.3433 0.0002 0.0006 0.0009 2.8630 6.3784 10.3484 19.0513 67.2794
frequency: 9.7444 18.6367 67.2588 78.8274 122.0370 149.7283 152.1993 214.4694 233.4675 240.6478 269.4325 299.8317 313.8589 325.1158 356.9058 370.8582 391.4975 416.4350 430.9460 474.6485 498.8887 516.7527 556.1765 608.9205 619.6791 636.6723 702.5194 713.6203 778.4481 809.5017 831.8434 863.0902 911.5721 925.3730 937.3168 971.2513 985.9486 989.3677 991.9119 1009.3535 1010.9700 1035.3020 1049.1315 1057.5863 1070.5116 1085.3589 1104.6657 1123.6753 1143.5962 1182.4637 1185.5349 1195.6790 1217.2483 1235.6757 1278.1833 1279.2822 1299.1018 1306.9270 1338.7363 1345.5610 1364.8886 1369.3584 1393.7748 1431.1331 1437.8504 1446.7062 1449.9124 1457.1087 1469.9411 1479.4081 1481.0314 1603.0443 1620.4036 2855.9144 2859.8559 2875.8883 2943.6334 2968.0733 3022.6523 3028.6191 3032.4763 3079.6863 3088.3051 3122.9259 3152.0125 3173.9323 3177.5473
redmass: 13.7407 4.5185 3.9220 4.7193 6.6276 3.8168 3.0534 1.7888 3.6089 2.0463 2.4316 6.2813 3.4283 6.9475 4.4674 2.6198 3.2082 5.6638 5.6983 4.1197 3.3518 8.6304 2.8425 11.9360 4.1571 6.2140 2.3103 5.3920 2.6598 1.5773 3.1954 3.2459 2.7701 1.4720 1.4489 2.4446 5.6481 4.7976 1.6253 5.4067 2.8833 2.2896 2.9070 2.5445 1.9334 2.5861 1.8373 1.5183 2.4949 1.4102 1.1109 1.5539 1.6159 1.3753 1.7655 1.5455 1.5683 1.5858 1.3210 1.4724 1.3825 1.5397 6.4114 1.1574 3.1023 1.0802 1.1039 1.0824 1.0845 2.5107 1.0707 6.2802 6.4220 1.0702 1.0636 1.0605 1.0829 1.0661 1.0743 1.0884 1.0908 1.1010 1.0982 1.0890 1.0915 1.0966 1.0935
irintensity: 0.0269 0.3594 0.5215 0.1839 0.3612 0.3179 4.0971 0.7258 1.6582 1.1940 5.1647 0.5573 5.1090 10.8425 4.5235 1.7440 0.7288 0.6179 0.8918 1.5993 4.5325 2.1153 8.1055 17.1218 6.6246 3.6112 27.5430 15.7405 6.3329 62.1010 2.8864 34.4993 21.3482 1.3998 39.8121 26.4853 183.4519 12.7860 10.7500 154.7644 21.6276 32.4909 22.0933 81.3456 40.3649 40.3435 18.1329 2.3039 38.0959 36.1315 3.1465 60.1537 4.3079 42.9427 134.0560 24.3261 32.9614 59.5959 6.5816 10.6095 2.0636 5.2545 2.4325 1.4365 26.2216 0.1752 12.7323 19.4619 18.1925 4.9797 11.8207 3.3039 4.3810 55.7373 44.8703 173.9672 37.6828 70.3367 43.0418 54.1059 27.1372 31.5945 30.7714 8.7754 10.1615 5.1260 4.1705
temp: 298.150 k
press: 1.00000 atm
elementType: 9 9 9 8 7 6 6 6 6 6 6 6 6 6 6 6 6 1 1 1 1 1 1 1 1 1 1 1 1 1 1
symmnumber: 1
zpe: 632382.1 jmol-1
zpe.correction: 0.240862 hartree
zpe.thermalcorrener: 0.256515 hartree
zpe.thermalcorrenthalpy: 0.257459 hartree
zpe.thermalcorrgfe: 0.195406 hartree
zpe.sumelectzpe: -893.879269 hartree
zpe.sumelectthermal: -893.863616 hartree
zpe.sumelectthermalent: -893.862672 hartree
zpe.sumelectthermalfe: -893.924725 hartree
dipole: -4.8177 2.7971 0.3816
dipole: 5.5839
quadrupole: -99.3154 -92.1447 -101.6932
quadrupole: 11.1988 -2.9957 -0.2014
quadrupole: -1.5976 5.5730 -3.9754 11.1988 -2.9957 -0.2014
hfenergy: -894.1201309 hartree
pointgroup: C01 [X(C12H14F3N1O1)]
dipole: 1.8174518 0.691362 -1.0223262 debye
polarizability: 177.9237374|-8.0026684|122.5807036|1.6129855|-22.3325743|113.2318858 unknown
InChI: InChI=1S/C12H14F3NO/c1-16-5-6-17-11(8-16)9-3-2-4-10(7-9)12(13,14)15/h2-4,7,11H,5-6,8H2,1H3
charge 0 multiplicity 1
31 atoms
F  -4.49849 -0.699334 0.041001
F  -2.833807 -2.125376 0.63633
F  -3.534158 -0.534895 2.084353
O  1.703072 -0.204752 1.427388
N  3.713287 -0.269612 -0.649096
C  1.581213 0.647723 0.231594
C  2.287417 -0.031676 -0.970031
C  3.841254 -1.11962 0.559264
C  3.122904 -0.449307 1.74012
C  0.104615 0.877692 -0.034376
C  4.471115 -0.796265 -1.800487
C  -0.865583 -0.027325 0.449036
C  -0.309741 1.990379 -0.80817
C  -2.231692 0.180969 0.149261
C  -1.674791 2.191169 -1.106353
C  -2.646457 1.286095 -0.62846
C  -3.250297 -0.770654 0.706845
H  2.095072 1.616011 0.423224
H  1.741208 -0.980246 -1.208414
H  2.222395 0.629165 -1.854453
H  4.913879 -1.239449 0.803055
H  3.407949 -2.139414 0.395618
H  3.117442 -1.099531 2.630025
H  3.619916 0.513838 1.981469
H  4.112578 -1.797899 -2.147092
H  5.538356 -0.888839 -1.5307
H  4.393893 -0.092979 -2.648888
H  -0.541822 -0.873335 1.061125
H  0.436828 2.706485 -1.173493
H  -1.984288 3.054133 -1.704687
H  -3.706366 1.432147 -0.856311
