program: Gaussian 09
title: 000210377
version: EM64L-G09RevD.01
frameworkgroup: C1[X(C13H21NO4S2)]
method: RPBEPBE
basis: SDD
operation: Freq
keyword: #p
keyword: freq=noraman
keyword: PBEPBE/SDD
title: #p freq=noraman PBEPBE/SDD
converged: YES YES NO NO
title: Mulliken charges:
elementType: S S O O O O N C C C C C C C C C C C C C H H H H H H H H H H H H H H H H H H H H H
charge: 0.101163 0.969853 -0.269428 -0.558492 -0.493603 -0.502418 -0.280264 -0.383317 -0.394331 -0.361987 -0.304092 -0.267234 -0.762528 0.352922 -0.340837 -0.380097 0.440240 -0.422255 -0.331573 -0.808873 0.217668 0.185661 0.214335 0.214357 0.220265 0.201331 0.202284 0.205204 0.270260 0.221000 0.230030 0.308723 0.299093 0.244317 0.247430 0.226405 0.229586 0.227982 0.229022 0.222537 0.379664
chargesum: 0.00000
title: Mulliken charges with hydrogens summed into heavy atoms:
elementType: S S O O O O N C C C C C C C C C C C C C
charge: 0.101163 0.969853 -0.269428 -0.178828 -0.493603 -0.502418 -0.010004 0.020012 0.034361 0.059609 0.103397 0.183796 -0.154713 0.352922 -0.096521 -0.132667 0.440240 -0.195850 -0.101987 -0.129333
polarizability: 6.15091931e+02 1.36648835e+01 1.80626334e+02 1.43999175e+01 -5.76201101e+00 1.60278730e+02
1716.lowfreq: -6.1920 -3.7966 -0.0021 0.0008 0.0013 4.2552 8.9624 12.5028 16.8640
frequency: 8.0576 11.4240 15.7897 24.0054 31.6109 44.8519 65.4929 67.9933 82.4501 90.0062 114.0485 124.8390 129.2140 135.5894 149.2763 160.1017 165.2270 174.7450 185.0537 211.4553 242.8662 264.2880 282.5841 305.1703 319.7375 329.3828 334.5835 401.1368 406.2015 412.9503 443.8718 490.3280 507.8337 523.4985 539.4638 613.4185 634.7431 699.4340 710.9433 733.5158 742.7910 752.3673 803.7711 816.5903 819.7417 826.7689 828.7704 925.5662 932.4064 933.2453 962.4493 970.0495 980.2067 987.7529 1006.1616 1022.2355 1036.0131 1047.0755 1056.1900 1067.5664 1070.6358 1108.0022 1114.9095 1121.1449 1151.5916 1159.2562 1180.5361 1190.8993 1216.5491 1224.7999 1239.2175 1250.4649 1271.9336 1283.3072 1288.7947 1291.9516 1306.3186 1320.0750 1349.3761 1369.8746 1381.6199 1388.5999 1399.6178 1415.1730 1419.7741 1455.8449 1469.5098 1471.4870 1471.6344 1477.8631 1480.2863 1486.8498 1491.9638 1504.6977 1586.5915 1625.7396 2878.4546 2916.5477 2941.0774 2957.1628 2962.6820 2973.3077 2994.9135 2996.7942 3001.9539 3026.0052 3029.2469 3050.1118 3055.3697 3064.5291 3080.3237 3121.3184 3123.6802 3159.0129 3162.8466 3454.3817 3455.2659
redmass: 6.3520 4.5863 7.1246 4.9329 6.1128 4.2115 1.6642 1.4957 3.1550 2.4001 3.1648 4.5667 2.3982 3.2705 2.1890 4.3419 3.8037 2.9402 2.4772 4.4362 4.4626 4.0701 9.1665 6.4834 4.7241 4.2744 3.2665 8.7329 4.0056 2.9356 5.0786 3.5969 2.4540 17.2558 4.7380 1.2879 6.7572 4.5707 2.9852 5.0074 1.2330 1.0790 1.3102 6.0584 1.2584 14.0534 1.3422 1.2730 7.9524 1.2990 1.3460 3.4540 2.0091 1.7526 2.6142 2.6890 3.3473 1.5258 1.2414 3.1635 2.6299 2.5749 1.3560 1.2642 1.8536 1.9869 1.2843 1.4184 2.1308 5.1079 1.2294 1.2504 1.2656 1.0584 1.1409 1.1211 1.2912 1.2714 1.3946 3.6645 1.4281 1.6202 1.2557 3.4851 1.0802 1.2418 1.0694 1.0457 1.0950 1.0989 1.1082 1.1332 1.1216 2.1583 6.4542 6.3906 1.0700 1.0692 1.0551 1.0633 1.0635 1.0372 1.0628 1.1058 1.0830 1.0903 1.0997 1.0977 1.0980 1.1048 1.0986 1.0893 1.0889 1.0940 1.0953 1.0698 1.0711
irintensity: 0.8070 0.8439 0.6118 0.4223 0.3411 1.5070 1.4510 1.0933 0.6807 0.0448 24.1883 3.0081 5.0770 5.3900 2.1265 2.3422 6.9851 21.5620 58.9912 65.6787 9.9337 12.3661 25.2104 15.5493 2.4690 4.7914 8.4836 31.6972 37.7719 0.0337 1.6922 41.5753 20.8186 205.3981 2.4875 198.3947 0.2401 1.6722 0.5919 17.1760 8.3984 10.8479 31.2203 15.1670 19.4280 105.1251 24.3533 3.6764 74.3809 10.5131 0.4725 34.6149 20.2093 3.5483 13.3924 1.8024 4.8985 11.0834 67.6261 0.2285 2.8102 6.1188 27.1740 15.9817 6.4030 16.3091 42.6504 82.8393 147.5372 52.6851 18.4154 3.1155 16.7332 0.3291 0.3479 14.3000 1.6898 27.7389 1.5005 2.4100 76.1689 6.4742 10.0851 1.5784 14.4423 34.7331 0.6600 12.2190 10.0944 13.6887 8.5615 8.9520 51.5053 108.0437 10.9081 4.9464 81.5415 33.9448 26.0285 4.4980 23.3686 57.1940 17.3069 30.2716 34.1581 19.9566 12.9763 23.9322 5.8815 77.3554 19.5886 17.2932 36.3103 19.0107 1.5306 92.8618 17.2965
temp: 298.150 k
press: 1.00000 atm
elementType: 16 16 8 8 8 8 7 6 6 6 6 6 6 6 6 6 6 6 6 6 1 1 1 1 1 1 1 1 1 1 1 1 1 1 1 1 1 1 1 1 1
symmnumber: 1
zpe: 850226.5 jmol-1
zpe.correction: 0.323834 hartree
zpe.thermalcorrener: 0.348605 hartree
zpe.thermalcorrenthalpy: 0.349549 hartree
zpe.thermalcorrgfe: 0.262200 hartree
zpe.sumelectzpe: -1657.989176 hartree
zpe.sumelectthermal: -1657.964406 hartree
zpe.sumelectthermalent: -1657.963462 hartree
zpe.sumelectthermalfe: -1658.050811 hartree
dipole: -3.9565 -0.2359 0.0739
dipole: 3.9642
quadrupole: -167.5020 -138.3998 -132.6607
quadrupole: -12.9079 10.0043 -1.8324
quadrupole: -21.3145 7.7877 13.5268 -12.9079 10.0043 -1.8324
hfenergy: -1658.3130107 hartree
pointgroup: C01 [X(C13H21N1O4S2)]
dipole: 1.5571015 0.0692513 0.0556572 debye
polarizability: 615.8276421|5.5236616|181.004576|-5.5849409|4.7238613|159.1647759 unknown
InChI: InChI=1S/C13H20NOS.HO3S/c1-12-4-6-13(7-5-12)15-10-3-2-8-14-9-11-16;1-4(2)3/h4-7,14H,2-3,8-11H2,1H3;1H
charge 0 multiplicity 1
41 atoms
S  -6.696603 0.952004 -1.400389
S  -7.756011 -0.505037 0.303073
O  3.400874 0.786494 0.443148
O  -7.708894 0.728014 1.697747
O  -9.304938 -0.899489 0.05762
O  -6.691825 -1.685947 0.641636
N  -2.738457 0.147505 -0.520173
C  -0.259832 0.063579 -0.311071
C  1.003302 0.80003 0.188271
C  -1.544803 0.872521 -0.047233
C  2.276016 -0.00903 -0.073117
C  -4.030992 0.841784 -0.450403
C  -5.045278 0.080209 -1.323338
C  4.692842 0.238351 0.331996
C  4.986784 -1.021601 -0.241219
C  5.741927 1.042024 0.844023
C  7.394172 -0.679353 0.211812
C  6.331004 -1.463298 -0.293468
C  7.070024 0.583566 0.781349
C  8.834121 -1.161346 0.154918
H  -0.186047 -0.13939 -1.397144
H  -0.337673 -0.922451 0.19479
H  1.09632 1.781536 -0.314789
H  0.926782 1.000275 1.274151
H  -1.495812 1.837342 -0.589833
H  -1.606989 1.122221 1.040695
H  2.23727 -0.988769 0.449265
H  2.413728 -0.194043 -1.159633
H  -2.779029 -0.828586 -0.198805
H  -3.892581 1.867263 -0.842778
H  -4.44047 0.941069 0.581753
H  -5.235463 -0.930618 -0.904588
H  -4.687436 -0.042144 -2.362419
H  4.196479 -1.661057 -0.645617
H  5.492878 2.013697 1.2820
H  6.549332 -2.441487 -0.739151
H  7.872419 1.216004 1.181196
H  9.477802 -0.449931 -0.396283
H  9.264982 -1.269921 1.168541
H  8.911845 -2.141126 -0.347409
H  -8.395366 0.439133 2.370769
