program: Gaussian 09
title: 000210375
version: EM64L-G09RevD.01
frameworkgroup: C1[X(C13H21NO3S3)]
method: RPBEPBE
basis: SDD
operation: Freq
keyword: #p
keyword: freq=noraman
keyword: PBEPBE/SDD
title: #p freq=noraman PBEPBE/SDD
converged: YES YES NO NO
title: Mulliken charges:
elementType: S S S O O O N C C C C C C C C C C C C C H H H H H H H H H H H H H H H H H H H H H
charge: 0.200654 0.097121 0.970556 -0.559753 -0.495558 -0.503295 -0.279733 -0.352240 -0.394612 -0.315382 -0.365430 -0.735116 -0.266389 -0.762508 -0.128863 -0.187488 -0.270106 -0.247927 -0.209179 -0.242597 0.191956 0.190012 0.222382 0.191690 0.236120 0.218415 0.217750 0.199289 0.264588 0.247037 0.272474 0.219561 0.229360 0.309608 0.298370 0.230149 0.243821 0.226297 0.229188 0.230801 0.378978
chargesum: 0.00000
title: Mulliken charges with hydrogens summed into heavy atoms:
elementType: S S S O O O N C C C C C C C C C C C C C
charge: 0.200654 0.097121 0.970556 -0.180775 -0.495558 -0.503295 -0.007259 0.029728 0.019460 0.139152 0.051610 -0.223491 0.182531 -0.154531 -0.128863 0.042661 -0.026285 -0.021631 0.020008 -0.011795
polarizability: 1.13483233e+03 9.44218268e+00 2.25332360e+02 -1.23316329e+01 -1.13151621e+01 1.76663424e+02
1716.lowfreq: -11.8218 -4.9204 0.0001 0.0005 0.0022 3.4451 5.6893 11.9552 12.6331
frequency: -10.3113 8.8905 11.8754 18.8193 22.0186 39.9409 42.9561 72.9054 85.7695 98.7761 110.3391 128.0423 134.0952 136.1419 146.9755 168.0872 185.7995 188.7624 204.8690 209.7564 220.6784 243.2431 278.5828 297.6940 305.6097 324.0574 369.1150 395.4246 400.3215 401.6147 451.7789 467.8816 475.5945 521.3707 606.0068 611.5686 670.5031 691.2878 694.9710 701.3121 732.4684 742.4392 746.2852 752.0897 818.3259 826.1259 836.0913 898.7328 930.9780 934.9744 966.4609 976.0716 983.9116 987.4574 1003.9763 1015.1573 1018.8963 1049.2770 1055.6016 1060.0661 1070.5753 1071.5788 1076.4708 1089.0137 1092.7846 1123.1436 1156.2840 1172.3958 1185.8234 1189.1738 1220.0254 1227.3242 1255.8742 1268.8483 1277.2127 1287.1056 1290.1692 1294.2783 1307.8784 1317.2729 1341.1882 1353.9684 1375.3289 1379.5786 1422.5766 1427.6982 1452.8304 1453.4233 1465.0843 1466.6912 1468.3164 1478.0988 1484.9422 1491.2365 1583.8290 1592.8512 2874.6450 2915.2516 2951.9103 2957.8256 2967.2666 2991.8179 2997.0688 3003.5820 3016.0190 3024.2512 3039.7374 3053.0565 3055.2968 3084.5619 3125.0365 3130.6050 3143.9171 3151.6822 3167.0717 3453.6602 3457.4625
redmass: 7.5691 6.4328 5.7030 7.0131 4.9912 4.9038 4.5389 2.2598 3.1284 3.4715 3.5089 3.8711 2.6621 2.5070 3.1731 2.8886 2.0551 4.7551 3.2266 4.9211 3.5919 4.0077 7.2176 5.3683 5.9580 4.0780 5.8792 6.1272 12.1942 3.1156 3.2138 3.5281 3.7197 18.0882 1.2921 6.3821 6.1919 2.3666 4.8610 4.4855 1.0780 1.5058 1.2286 1.1474 1.2517 14.7338 1.2532 1.3713 9.2513 1.2904 1.3820 2.1454 6.1728 1.3086 4.9079 2.2803 3.1606 3.5156 2.1794 1.4285 1.4566 2.4449 2.2763 1.4433 3.2574 1.1560 3.6040 1.0499 1.4804 1.1207 1.2442 1.3162 1.2271 1.2164 1.1798 1.1024 1.1151 1.1162 1.3172 1.2685 1.3487 1.5442 7.4754 1.4296 1.0768 2.1553 1.2042 1.2438 1.6511 1.0660 1.1187 1.0940 1.0892 1.0870 6.1042 5.9514 1.0701 1.0691 1.0643 1.0594 1.0638 1.0605 1.0844 1.0989 1.0584 1.0901 1.1016 1.1032 1.0975 1.1056 1.0844 1.0875 1.0920 1.0962 1.1016 1.0660 1.0750
irintensity: 0.1778 0.1342 0.1707 0.9727 0.1940 2.2837 0.5107 0.1592 0.2622 2.0786 15.9526 11.6948 8.8547 2.0188 18.8228 8.6921 81.6465 0.3254 2.2630 146.0269 4.4511 12.0078 37.0446 20.6976 12.8355 6.2406 0.2495 12.6880 41.8515 4.1312 12.2007 13.8197 3.0665 334.6822 66.0002 0.0767 24.7494 32.2630 12.4631 3.0263 12.6081 77.9452 9.0450 10.2667 4.5573 183.4383 0.3176 1.8667 90.0352 8.1159 0.1390 5.6951 5.9115 0.3131 1.0346 2.6820 18.1989 35.9863 13.7875 54.4181 4.6899 14.7320 0.5473 3.3250 1.1915 0.5974 0.9084 0.1347 27.9671 15.7114 4.2874 16.4487 2.2453 4.3721 3.7440 0.9397 5.9200 1.8551 3.9195 1.9274 2.7908 0.1146 1.0756 10.7054 19.4733 7.6066 35.0667 5.5970 25.6476 1.6450 3.7147 5.1809 3.5112 15.0014 2.3952 33.4423 71.7105 38.1755 6.7486 11.7509 32.7960 11.6224 34.7257 3.2557 43.1420 18.4703 10.9974 56.2538 4.7455 30.8251 6.5442 0.7756 10.6874 35.5016 52.8080 123.3832 1.8653
temp: 298.150 k
press: 1.00000 atm
elementType: 16 16 16 8 8 8 7 6 6 6 6 6 6 6 6 6 6 6 6 6 1 1 1 1 1 1 1 1 1 1 1 1 1 1 1 1 1 1 1 1 1
symmnumber: 1
zpe: 844871.1 jmol-1
zpe.correction: 0.321794 hartree
zpe.thermalcorrener: 0.345788 hartree
zpe.thermalcorrenthalpy: 0.346732 hartree
zpe.thermalcorrgfe: 0.261674 hartree
zpe.sumelectzpe: -1980.830797 hartree
zpe.sumelectthermal: -1980.806804 hartree
zpe.sumelectthermalent: -1980.805859 hartree
zpe.sumelectthermalfe: -1980.890918 hartree
dipole: -3.3834 -0.7253 -1.9162
dipole: 3.9554
quadrupole: -190.2185 -137.5627 -146.3880
quadrupole: -21.3713 -9.4798 -1.1321
quadrupole: -32.1621 20.4937 11.6684 -21.3713 -9.4798 -1.1321
hfenergy: -1981.1525919 hartree
pointgroup: C01 [X(C13H21N1O3S3)]
dipole: 1.3467082 0.5723738 -0.5296109 debye
polarizability: 1129.1704217|30.3947579|212.8723755|67.1062358|26.7542447|194.7853145 unknown
InChI: InChI=1S/C13H20NS2.HO3S/c15-11-10-14-9-5-2-6-12-16-13-7-3-1-4-8-13;1-4(2)3/h1,3-4,7-8,14H,2,5-6,9-12H2;1H
charge 0 multiplicity 1
41 atoms
S  5.106253 1.879333 1.228918
S  -6.146754 -1.122418 -1.737019
S  -7.576251 -0.367818 0.149502
O  -7.791035 1.391744 -0.425207
O  -9.051128 -1.023913 0.252283
O  -6.634143 -0.351259 1.474281
N  -2.466435 0.041305 -0.257359
C  1.08544 1.576807 -0.208571
C  -0.087782 0.643698 0.167322
C  2.365278 1.266812 0.604759
C  -1.369377 0.952214 -0.631385
C  3.528913 2.202462 0.235808
C  -3.726358 0.147609 -1.003258
C  -4.571553 -1.111042 -0.731582
C  5.704254 0.269794 0.569148
C  5.283878 -0.28927 -0.661407
C  6.676158 -0.40626 1.350929
C  5.831606 -1.515916 -1.102723
C  7.224378 -1.62581 0.898369
C  6.803492 -2.190002 -0.329355
H  0.787839 2.633103 -0.042893
H  1.30087 1.477123 -1.293045
H  0.195673 -0.412095 -0.007343
H  -0.297515 0.74261 1.253285
H  2.663172 0.213623 0.439015
H  2.153673 1.36717 1.686839
H  -1.174619 0.822516 -1.714905
H  -1.647426 2.025399 -0.484871
H  3.291394 3.252491 0.483449
H  3.774118 2.162391 -0.840309
H  -2.594181 -0.054612 0.75839
H  -3.482851 0.21082 -2.081146
H  -4.329399 1.051555 -0.753713
H  -4.873921 -1.153821 0.336532
H  -4.019902 -2.039663 -0.967767
H  4.544655 0.219974 -1.288042
H  6.998351 0.018618 2.308352
H  5.498438 -1.93961 -2.057022
H  7.9758 -2.136849 1.510639
H  7.226067 -3.139135 -0.675777
H  -8.615572 1.748122 0.022782
