program: Gaussian 09
title: 000210376
version: EM64L-G09RevD.01
frameworkgroup: C1[X(C13H21NO4S2)]
method: RPBEPBE
basis: SDD
operation: Freq
keyword: #p
keyword: freq=noraman
keyword: PBEPBE/SDD
title: #p freq=noraman PBEPBE/SDD
converged: YES YES NO NO
title: Mulliken charges:
elementType: S S O O O O N C C C C C C C C C C C C C H H H H H H H H H H H H H H H H H H H H H
charge: 0.100413 0.969948 -0.274036 -0.558798 -0.493737 -0.502081 -0.281066 -0.383347 -0.394319 -0.362179 -0.302820 -0.267906 -0.760931 0.385656 -0.579935 0.477097 -0.377241 -0.381569 -0.215462 -0.806515 0.216644 0.187047 0.213137 0.215199 0.219900 0.201565 0.203653 0.205292 0.270245 0.220729 0.230398 0.309880 0.298559 0.253231 0.248018 0.229641 0.220437 0.229800 0.225739 0.230027 0.379685
chargesum: 0.00000
title: Mulliken charges with hydrogens summed into heavy atoms:
elementType: S S O O O O N C C C C C C C C C C C C C
charge: 0.100413 0.969948 -0.274036 -0.179113 -0.493737 -0.502081 -0.010821 0.020344 0.034017 0.059287 0.106125 0.183222 -0.152492 0.385656 -0.326704 0.477097 -0.129223 -0.151928 0.004975 -0.120949
polarizability: 4.70310882e+02 -6.26862483e+00 1.83665683e+02 2.15028036e+01 -4.14459252e-01 1.57078650e+02
1716.lowfreq: -6.2397 -2.4184 -0.0021 -0.0019 -0.0012 6.4807 13.3630 16.2419 18.9383
frequency: 11.7305 16.0946 18.7929 24.3624 31.9649 33.3913 49.6661 68.6432 83.5670 95.1957 116.9118 125.2278 133.3718 137.2591 148.4092 161.5931 178.7559 188.9570 211.9552 216.0454 232.6163 244.9125 256.0051 284.8172 306.0719 327.9527 332.5568 403.1374 413.1509 443.6670 457.5403 494.5302 511.4009 524.1281 562.1709 601.0049 612.2093 692.8727 698.8795 729.1484 747.1068 751.5444 777.3668 813.7979 828.2402 865.4574 886.2014 889.0753 928.7861 933.7512 965.2602 972.7861 980.8205 982.2592 1017.7932 1023.6184 1036.7129 1047.1270 1058.9585 1066.6374 1069.6677 1099.1518 1108.7099 1114.8656 1151.5717 1154.9674 1159.3153 1183.7616 1190.6098 1240.5753 1249.4571 1254.9851 1273.2313 1282.3561 1288.5291 1292.3886 1297.3539 1320.8960 1349.7690 1379.3759 1383.1753 1392.3412 1397.8080 1423.8654 1435.1459 1455.0057 1469.4525 1470.2908 1471.3757 1475.2609 1480.1644 1483.4006 1489.4750 1493.9632 1588.9469 1623.0877 2879.2186 2917.8609 2942.9018 2955.3803 2963.6270 2977.9919 2995.4050 2998.9813 3003.0622 3027.1850 3029.7273 3055.2761 3056.2242 3064.7619 3086.8932 3122.4840 3143.2464 3148.4964 3166.5205 3452.4188 3457.5651
redmass: 5.4037 5.1190 5.8050 5.8175 1.3785 2.7251 5.3451 3.0381 2.6629 2.7498 3.6935 5.3875 2.2561 2.4883 2.3768 5.2808 2.7624 2.3527 4.3076 2.9388 5.0884 4.1778 4.1547 9.3134 6.2885 4.7891 3.3914 11.7201 3.4058 2.8563 4.6130 3.5569 5.1095 16.8644 3.5807 5.7729 1.3086 2.0270 4.6870 6.5154 1.2133 1.0841 1.4748 1.1597 15.2441 1.3072 4.4095 1.4706 1.2216 9.4994 1.3180 2.2159 1.8839 4.9979 2.6167 2.2870 3.2883 1.5491 1.2608 2.9858 2.5720 1.6239 2.6157 1.3418 1.7795 1.8162 2.0822 1.1423 1.4151 1.2318 1.3245 3.3102 1.2797 1.0542 1.1403 1.1188 1.3349 1.2728 1.3981 2.2848 1.4968 2.2206 1.2967 1.0764 2.2254 1.2480 1.0696 1.0456 1.0895 2.3003 1.1369 1.1876 1.1120 1.1113 5.8908 6.5173 1.0701 1.0693 1.0551 1.0638 1.0635 1.0372 1.0619 1.1059 1.0836 1.0904 1.0998 1.0980 1.0976 1.1048 1.0987 1.0863 1.0933 1.0921 1.0963 1.0661 1.0749
irintensity: 0.7317 0.1290 0.5586 0.3248 1.0911 0.4592 1.1350 2.2643 0.9545 0.1319 23.0805 4.9796 1.9621 4.2449 3.5365 6.7175 14.2342 57.2759 57.5957 1.3149 0.5573 10.8188 17.5534 22.0022 15.5353 3.7973 7.4696 38.5749 48.8333 6.3446 9.2458 35.5670 6.0008 183.6836 0.1314 2.8147 248.4937 24.7866 1.6775 17.3469 9.3411 13.5692 53.8170 6.2420 93.8519 3.6706 4.9862 14.1546 9.1763 78.7130 0.2539 21.5080 11.3578 1.5907 55.5522 19.8103 39.3418 13.4439 65.9632 0.5336 10.1581 7.3850 0.7038 48.4447 10.9576 164.2632 12.1909 2.9062 95.8850 16.3788 35.3459 137.6661 26.0127 0.5013 1.5407 19.6605 4.1235 26.0648 3.6124 17.5623 86.5693 27.7685 21.8135 14.9629 19.6251 37.6065 0.5710 12.6600 11.0400 14.6696 42.8979 38.0861 23.2800 8.7338 76.1687 113.2367 86.4974 34.2883 32.8850 3.6456 23.7075 37.5144 19.0951 28.0339 32.4521 20.2766 14.0344 7.9354 21.1695 77.8514 20.3727 4.5873 38.9038 4.5998 13.5073 76.4991 34.1809
temp: 298.150 k
press: 1.00000 atm
elementType: 16 16 8 8 8 8 7 6 6 6 6 6 6 6 6 6 6 6 6 6 1 1 1 1 1 1 1 1 1 1 1 1 1 1 1 1 1 1 1 1 1
symmnumber: 1
zpe: 850506.0 jmol-1
zpe.correction: 0.323941 hartree
zpe.thermalcorrener: 0.348690 hartree
zpe.thermalcorrenthalpy: 0.349634 hartree
zpe.thermalcorrgfe: 0.262845 hartree
zpe.sumelectzpe: -1657.989813 hartree
zpe.sumelectthermal: -1657.965064 hartree
zpe.sumelectthermalent: -1657.964119 hartree
zpe.sumelectthermalfe: -1658.050908 hartree
dipole: 3.9926 -0.3720 -0.1058
dipole: 4.0113
quadrupole: -169.7217 -134.6741 -135.3653
quadrupole: 12.0920 4.9058 3.5565
quadrupole: -23.1347 11.9129 11.2218 12.0920 4.9058 3.5565
hfenergy: -1658.3137536 hartree
pointgroup: C01 [X(C13H21N1O4S2)]
dipole: 1.5691015 0.1346521 0.1018497 debye
polarizability: 471.3500061|6.7794291|183.4528131|-11.3979116|2.2876634|156.2523953 unknown
InChI: InChI=1S/C13H20NOS.HO3S/c1-12-5-4-6-13(11-12)15-9-3-2-7-14-8-10-16;1-4(2)3/h4-6,11,14H,2-3,7-10H2,1H3;1H
charge 0 multiplicity 1
41 atoms
S  -6.596438 0.648381 -1.671202
S  -7.794421 -0.236491 0.309071
O  3.465669 0.580894 0.253206
O  -7.685757 1.310915 1.339634
O  -9.362817 -0.576556 0.109755
O  -6.830144 -1.355398 0.985988
N  -2.702914 -0.071538 -0.485934
C  -0.227816 -0.197015 -0.242601
C  1.065709 0.601352 0.034471
C  -1.477408 0.705058 -0.223375
C  2.310049 -0.288357 -0.01956
C  -3.961052 0.670368 -0.638997
C  -5.003372 -0.254433 -1.295055
C  4.74583 -0.003048 0.226968
C  5.818857 0.888787 0.478271
C  7.153675 0.43097 0.476056
C  4.995185 -1.372777 -0.028592
C  7.404515 -0.946179 0.217452
C  6.335076 -1.829234 -0.030048
C  8.304676 1.386677 0.742679
H  -0.169763 -0.698347 -1.228308
H  -0.340971 -0.998029 0.518575
H  1.178859 1.41255 -0.71004
H  1.014817 1.082516 1.029897
H  -1.389117 1.477416 -1.012869
H  -1.524905 1.250571 0.751218
H  2.257429 -1.094078 0.743212
H  2.419725 -0.756555 -1.020632
H  -2.789125 -0.913419 0.098089
H  -3.767898 1.540749 -1.294593
H  -4.376086 1.069245 0.315576
H  -5.263603 -1.09521 -0.617477
H  -4.634253 -0.683031 -2.245139
H  5.584379 1.940952 0.672124
H  4.180541 -2.076362 -0.22263
H  8.435981 -1.317692 0.211587
H  6.537064 -2.888217 -0.227897
H  9.006994 1.413803 -0.111625
H  7.947048 2.415513 0.918267
H  8.885966 1.074651 1.630777
H  -8.406183 1.252697 2.036198
