program: Gaussian 09
title: 000210381
version: EM64L-G09RevD.01
frameworkgroup: C1[X(C14H17NO4S2)]
method: RPBEPBE
basis: SDD
operation: Freq
keyword: #p
keyword: freq=noraman
keyword: PBEPBE/SDD
title: #p freq=noraman PBEPBE/SDD
converged: YES YES NO NO
title: Mulliken charges:
elementType: S S O O O O N C C C C C C C C C C C C C C H H H H H H H H H H H H H H H H H
charge: 0.099942 0.965806 -0.297214 -0.551878 -0.496331 -0.499293 -0.286892 -0.380263 0.143987 -0.289988 0.252168 -0.263239 0.432793 -0.762943 -0.383213 -0.370454 -0.451059 -0.420081 -0.240079 -0.234712 -0.237021 0.217178 0.215684 0.224472 0.212444 0.217683 0.221274 0.297237 0.300495 0.313521 0.247067 0.260148 0.238797 0.238720 0.225295 0.231774 0.228770 0.379403
chargesum: 0.00000
title: Mulliken charges with hydrogens summed into heavy atoms:
elementType: S S O O O O N C C C C C C C C C C C C C C
charge: 0.099942 0.965806 -0.297214 -0.172475 -0.496331 -0.499293 0.010346 0.052598 0.143987 0.146928 0.252168 0.175719 0.432793 -0.148928 -0.136146 -0.110306 -0.212262 -0.181361 -0.014784 -0.002938 -0.008250
polarizability: 7.84706817e+02 -3.04780202e+01 3.01167029e+02 -1.20644698e+01 1.15361366e+01 1.41625482e+02
1716.lowfreq: -9.3213 -2.5565 -0.0016 -0.0003 0.0015 2.3107 9.6804 11.1530 18.6597
frequency: 9.0849 11.0309 18.6106 28.8758 34.8333 74.5959 89.3581 94.9881 104.0073 130.2330 143.3113 151.8331 166.2601 177.5889 181.3054 207.1197 236.8460 259.1274 264.1187 278.5943 280.6190 307.5911 313.2256 363.6843 402.8418 419.9717 441.4306 468.7264 473.2403 521.0146 521.6356 526.0833 572.2650 617.9562 640.4213 660.5825 696.6394 715.0022 742.2804 747.8112 781.9774 782.9768 806.8825 816.9290 826.9975 864.0233 884.7379 894.0424 910.9159 930.6590 962.8069 976.3286 983.5720 996.4836 1015.7125 1024.8589 1052.8422 1060.1200 1061.9637 1086.2036 1089.7396 1094.6308 1147.4287 1153.0618 1172.5279 1182.1771 1185.9261 1208.1284 1228.8053 1235.1600 1239.1041 1267.7502 1278.5123 1288.4137 1331.7709 1359.9228 1375.7660 1387.3258 1405.0685 1422.6601 1424.9186 1439.8732 1449.8757 1455.5791 1464.5645 1468.2250 1483.6857 1516.6537 1578.7001 1596.2138 1635.0767 2902.1952 2910.3580 2958.9446 2970.8122 3016.3352 3018.2851 3040.3752 3059.1957 3123.8884 3130.3340 3138.7001 3150.7222 3156.4666 3169.6571 3174.0917 3450.7696 3459.8281
redmass: 7.2335 9.5370 6.9423 6.1065 6.6402 5.4719 3.3792 3.8160 2.7491 4.1021 5.4128 5.5324 3.0999 1.9164 3.5342 4.7980 3.3426 3.1231 4.1658 4.6711 7.2560 6.0236 4.2913 4.2282 13.4575 3.1131 4.4475 3.6738 3.8796 6.5563 4.1910 15.6810 3.2719 5.1338 3.2308 1.3292 4.2182 4.6243 1.3306 1.2205 1.6446 5.0711 1.9478 3.2471 14.9512 1.4851 2.1261 1.6636 2.8754 9.5401 1.3338 1.3809 1.8761 1.3330 2.1328 2.3787 2.7267 2.0123 1.6377 2.2600 2.1608 1.9777 1.4477 1.9312 1.0805 1.8510 1.2639 1.1681 1.9733 1.6745 1.3909 1.7540 1.2260 1.1204 1.2728 1.3227 1.8353 1.6711 3.2035 1.2171 3.5112 2.4034 1.8729 1.3375 1.1038 1.2105 1.0793 3.8011 6.9934 5.5629 6.9696 1.0693 1.0693 1.0642 1.0559 1.0892 1.0902 1.1083 1.0974 1.0863 1.0861 1.0901 1.0937 1.0956 1.0963 1.0978 1.0660 1.0750
irintensity: 0.2231 0.1529 0.4421 0.5532 0.3860 2.2439 1.8578 12.0837 10.1033 1.3497 5.6561 13.2621 3.3335 99.0763 16.6404 85.3623 21.9731 25.2187 2.3039 6.1514 33.5770 3.4943 5.6499 1.4148 45.0149 7.0886 4.2960 4.0857 5.1054 16.0614 33.1669 336.4516 8.5173 7.1206 0.5663 119.3770 5.5984 5.8427 2.5773 6.2573 90.4146 2.4477 66.2354 11.2805 72.4760 0.3464 3.6616 3.7735 9.8016 85.4404 0.0131 4.7212 6.9262 0.0062 4.9149 13.8090 13.3048 44.1323 27.7789 19.4424 2.8479 10.6783 0.1340 5.4136 1.0183 14.0278 11.8968 10.0081 20.6932 8.2835 34.7069 9.7846 19.3500 4.5515 8.6891 6.7733 34.2081 11.0423 14.6252 30.4874 34.5457 43.6661 12.5872 12.0645 3.9505 2.6387 6.0039 2.7449 66.2639 39.6941 11.5922 36.8142 73.3589 6.4725 36.8127 44.5588 30.7262 49.1940 4.3330 2.3642 1.5250 12.4952 36.9661 47.1224 31.6429 10.3571 139.1184 33.5708
temp: 298.150 k
press: 1.00000 atm
elementType: 16 16 8 8 8 8 7 6 6 6 6 6 6 6 6 6 6 6 6 6 6 1 1 1 1 1 1 1 1 1 1 1 1 1 1 1 1 1
symmnumber: 1
zpe: 754927.3 jmol-1
zpe.correction: 0.287537 hartree
zpe.thermalcorrener: 0.310042 hartree
zpe.thermalcorrenthalpy: 0.310986 hartree
zpe.thermalcorrgfe: 0.230267 hartree
zpe.sumelectzpe: -1693.701502 hartree
zpe.sumelectthermal: -1693.678997 hartree
zpe.sumelectthermalent: -1693.678052 hartree
zpe.sumelectthermalfe: -1693.758772 hartree
dipole: 3.4564 -2.9694 -0.2602
dipole: 4.5642
quadrupole: -145.1186 -118.9064 -147.4037
quadrupole: -3.0422 0.2939 -3.6591
quadrupole: -7.9757 18.2365 -10.2608 -3.0422 0.2939 -3.6591
hfenergy: -1693.9890386 hartree
pointgroup: C01 [X(C14H17N1O4S2)]
dipole: -1.1894909 -1.0363334 -0.8577065 debye
polarizability: 767.0708194|85.2246956|244.5559116|45.9564715|87.6998469|215.8725972 unknown
InChI: InChI=1S/C14H16NOS.HO3S/c17-11-9-15-8-10-16-14-7-3-5-12-4-1-2-6-13(12)14;1-4(2)3/h1-7,15H,8-11H2;1H
charge 0 multiplicity 1
38 atoms
S  5.594805 -0.47816 -0.002969
S  5.468465 1.620135 1.307478
O  -1.184551 -0.410025 -1.185152
O  6.521449 1.058126 2.733502
O  6.19268 2.912666 0.657439
O  3.93257 1.769217 1.815725
N  1.635724 -0.841589 -1.134468
C  0.85112 -0.830348 -2.378704
C  -3.023355 0.282067 0.195233
C  -0.558293 -1.36003 -2.123082
C  -2.48791 -0.683401 -0.734258
C  3.035275 -0.408631 -1.220866
C  -4.358442 0.069705 0.712147
C  3.757944 -0.817402 0.076414
C  -3.237837 -1.795533 -1.13581
C  -2.279214 1.430331 0.616285
C  -5.109156 -1.078431 0.288666
C  -4.894603 1.022857 1.640079
C  -4.556219 -1.984603 -0.615317
C  -2.831668 2.340231 1.522713
C  -4.149219 2.134879 2.039561
H  0.77632 0.187168 -2.830741
H  1.346191 -1.485301 -3.122569
H  -0.517705 -2.367244 -1.662826
H  -1.141947 -1.400736 -3.064249
H  3.504193 -0.916402 -2.086064
H  3.162434 0.68783 -1.381036
H  1.11685 -0.433835 -0.345426
H  3.633082 -1.894024 0.293062
H  3.362318 -0.246604 0.942939
H  -2.835416 -2.527159 -1.841854
H  -1.274084 1.584269 0.214013
H  -6.119415 -1.231261 0.684213
H  -5.905779 0.86266 2.032709
H  -5.12997 -2.8598 -0.938943
H  -2.25491 3.215576 1.840475
H  -4.57118 2.854495 2.749753
H  6.875955 1.884603 3.179929
