program: Gaussian 09
title: 000210407
version: EM64L-G09RevD.01
frameworkgroup: C1[X(C20H13Cl2F3N2O)]
method: RPBEPBE
basis: SDD
operation: Freq
keyword: #p
keyword: freq=noraman
keyword: PBEPBE/SDD
title: #p freq=noraman PBEPBE/SDD
converged: YES YES NO NO
title: Mulliken charges:
elementType: Cl Cl F F F O N N C C C C C C C C C C C C C C C C C C C C H H H H H H H H H H H H H
charge: -0.047277 -0.044760 -0.163860 -0.168929 -0.168445 -0.337734 -0.514206 -0.480035 0.298341 0.078870 0.480304 -0.497324 0.320642 -0.370090 0.194180 -0.329535 -0.435446 -0.391547 -0.224708 -0.282880 -0.180178 0.539268 0.242711 -0.299091 -0.464553 -0.027898 -0.059682 -0.271539 0.379962 0.298288 0.275509 0.213249 0.251931 0.267281 0.237922 0.325364 0.237692 0.237690 0.340552 0.254388 0.285573
chargesum: 0.00000
title: Mulliken charges with hydrogens summed into heavy atoms:
elementType: Cl Cl F F F O N N C C C C C C C C C C C C C C C C C C C C
charge: -0.047277 -0.044760 -0.163860 -0.168929 -0.168445 -0.337734 -0.134244 -0.154672 0.298341 0.078870 0.480304 -0.199036 0.320642 -0.094581 0.194180 -0.116286 -0.183515 -0.124266 0.013214 -0.045187 0.057512 0.539268 0.242711 0.041461 -0.210165 -0.027898 -0.059682 0.014034
polarizability: 4.35124034e+02 -2.19230466e+01 3.18409618e+02 -1.98324010e+01 1.96686169e+01 1.37821095e+02
1716.lowfreq: -0.8987 -0.0026 -0.0020 -0.0017 4.8285 5.8931 12.3533 14.3424 16.9825
frequency: 12.3204 14.2429 16.9770 30.4138 50.2294 53.1148 68.1822 95.4511 113.0904 131.7264 140.2451 147.1765 155.4437 181.9797 203.8134 208.9544 228.4865 248.3180 264.5784 276.7243 304.3789 317.8481 338.0591 368.1542 375.2029 396.4901 408.8853 422.0850 431.0290 438.0656 478.0690 484.1369 514.3799 518.0502 523.8453 562.3220 578.3959 581.6640 605.0055 614.2142 639.5374 650.1584 672.6087 681.8048 687.5513 696.2433 704.9900 748.1288 755.1263 769.4190 798.0494 829.0394 835.4736 848.5633 857.4871 857.8094 866.4352 900.4859 907.2655 913.4236 916.0507 919.9998 947.2217 976.7315 979.4025 981.9726 984.6499 990.5398 1011.1772 1048.0763 1064.5465 1069.3805 1094.5994 1106.8066 1107.3061 1141.9748 1183.4960 1187.5406 1211.2093 1235.9074 1252.8905 1256.0986 1276.8931 1283.8104 1314.2530 1335.1112 1364.4783 1380.6206 1398.0176 1403.7553 1438.0002 1439.7802 1447.5221 1459.4380 1482.5187 1502.9935 1526.3816 1568.7321 1582.2151 1590.0045 1602.7095 1607.8616 1625.1027 1631.7514 3117.4872 3136.6304 3142.2481 3149.9991 3158.5406 3165.5601 3172.1295 3180.1108 3181.9228 3193.7421 3210.0060 3232.3962 3540.5816
redmass: 13.8919 18.1405 11.7524 7.2384 6.6109 8.0551 6.7954 6.7776 7.9866 7.0780 7.5015 9.4226 8.7401 6.6973 4.7769 6.9436 5.4468 5.1906 9.9391 4.9068 7.1805 7.5521 8.9339 8.6881 12.6100 6.5521 6.3312 6.3871 5.1962 4.7045 5.0008 5.4476 4.8770 10.4769 3.5350 3.7550 6.6297 7.0265 8.8397 7.1567 1.9920 2.5133 2.3823 4.9597 2.9282 4.3111 4.1233 1.9793 9.7680 2.0002 1.6368 3.8894 1.3574 1.4205 1.5986 1.6366 4.9894 4.1703 2.1046 1.4996 2.3029 1.4872 1.4009 5.9533 5.8480 3.0237 1.8776 1.3728 5.8033 2.8320 3.0352 3.1695 1.5335 1.7495 1.7307 1.9439 1.0691 1.0837 2.1351 2.0222 1.5042 2.0475 2.2991 2.0746 1.5291 2.0105 4.3085 7.3525 7.6510 4.6200 3.0777 2.8916 3.4544 2.9003 2.5260 2.6829 3.0895 7.0512 3.5182 4.8411 5.2225 5.1973 5.3663 2.8989 1.0881 1.0885 1.0883 1.0928 1.0930 1.0937 1.0942 1.0966 1.0973 1.0939 1.0934 1.0799 1.0759
irintensity: 0.0758 0.1963 0.3544 1.3508 1.2959 0.3269 1.3825 1.8363 1.0012 0.0068 2.5894 0.3243 0.3079 1.2203 0.0293 1.0433 1.4818 1.5770 2.0674 3.0306 3.9527 5.9678 4.2000 6.1887 12.6036 3.4955 3.7374 12.6052 2.8653 1.5063 3.1402 22.7643 0.2827 0.8157 7.8115 1.9525 9.6000 10.8146 38.5900 3.7065 45.5661 35.6306 31.3554 9.0686 32.4938 3.4900 15.2242 41.6296 92.8820 36.8454 27.3047 35.6599 126.0304 30.8113 22.6063 63.7754 11.9769 1.9379 20.2090 34.6513 31.5762 34.5129 1.0531 14.0579 191.9019 30.5331 6.4208 1.2829 130.3500 20.3675 143.6343 23.5392 3.6302 17.6469 12.7781 16.0840 9.8646 0.3040 56.0290 357.1508 45.9232 33.9108 82.1250 229.3094 76.8923 37.1786 369.5144 23.6400 14.7580 78.8577 49.5552 96.5802 250.2586 53.0814 11.5607 807.5348 328.1982 208.1895 148.1223 62.9632 342.6941 265.7875 6.7111 67.5902 15.1522 7.9583 7.0379 3.0457 10.0510 17.8153 4.1098 8.1594 2.5209 4.2360 25.6539 370.3288 16.8196
temp: 298.150 k
press: 1.00000 atm
elementType: 17 17 9 9 9 8 7 7 6 6 6 6 6 6 6 6 6 6 6 6 6 6 6 6 6 6 6 6 1 1 1 1 1 1 1 1 1 1 1 1 1
symmnumber: 1
zpe: 747858.8 jmol-1
zpe.correction: 0.284844 hartree
zpe.thermalcorrener: 0.309253 hartree
zpe.thermalcorrenthalpy: 0.310197 hartree
zpe.thermalcorrgfe: 0.226191 hartree
zpe.sumelectzpe: -2172.391250 hartree
zpe.sumelectthermal: -2172.366841 hartree
zpe.sumelectthermalent: -2172.365897 hartree
zpe.sumelectthermalfe: -2172.449903 hartree
dipole: -1.5228 2.3973 -1.8097
dipole: 3.3677
quadrupole: -206.5914 -156.0862 -182.6305
quadrupole: -13.0911 -11.9423 0.4603
quadrupole: -24.8220 25.6832 -0.8612 -13.0911 -11.9423 0.4603
hfenergy: -2172.6760944 hartree
pointgroup: C01 [X(C20H13Cl2F3N2O1)]
dipole: -0.6120578 1.15468 0.21808 debye
polarizability: 429.8959683|10.1037473|206.613026|-43.9019009|88.682276|254.8457526 unknown
InChI: InChI=1S/C20H13Cl2F3N2O/c21-13-9-14(22)11-16(10-13)27-19(28)17-6-1-2-7-18(17)26-15-5-3-4-12(8-15)20(23,24)25/h1-11,26-27H
charge 0 multiplicity 1
41 atoms
Cl -7.416004 -0.556118 2.506178
Cl -5.677267 -2.203937 -2.502604
F  6.775727 -2.071476 -0.141763
F  6.610124 0.151086 0.264874
F  5.43512 -1.312669 1.527748
O  -1.399946 0.091821 -1.118306
N  1.208058 0.435676 -0.88988
N  -2.673244 0.64442 0.763282
C  0.939229 1.396302 0.088886
C  -0.424878 1.594803 0.530494
C  2.436857 -0.159316 -1.243628
C  3.521955 -0.313496 -0.340856
C  4.70225 -0.961163 -0.767388
C  1.957962 2.235321 0.634486
C  -1.516082 0.735854 -0.012824
C  -0.701374 2.63739 1.460659
C  2.559074 -0.698383 -2.557845
C  4.829932 -1.483683 -2.073736
C  1.651574 3.233703 1.571364
C  0.314683 3.44719 1.993088
C  3.736215 -1.356423 -2.959001
C  -3.890227 -0.023257 0.468134
C  5.851257 -1.057509 0.194998
C  -4.123276 -0.709305 -0.754883
C  -4.904141 0.021061 1.466168
C  -6.127956 -0.619601 1.221405
C  -5.372005 -1.326411 -0.937605
C  -6.402004 -1.307755 0.023538
H  0.351038 0.11131 -1.379891
H  3.434408 0.016675 0.697252
H  2.985382 2.135238 0.276907
H  -1.739209 2.860324 1.737937
H  1.722147 -0.591988 -3.257348
H  5.750064 -1.986244 -2.382997
H  2.455407 3.871536 1.954601
H  -2.628022 1.079191 1.686757
H  0.073734 4.24716 2.699185
H  3.807785 -1.764747 -3.972097
H  -3.3415 -0.752702 -1.512685
H  -4.739968 0.545713 2.413147
H  -7.360181 -1.801291 -0.14965
