program: Gaussian 09
title: 000208042
version: EM64L-G09RevD.01
frameworkgroup: C1[X(C7H8N4O3)]
method: RPBEPBE
basis: SDD
operation: Freq
keyword: #pfreq=noraman
keyword: PBEPBE/SDD
title: #p freq=noraman PBEPBE/SDD
converged: NO YES NO NO
title: Mulliken charges:
elementType: O O O N N N N C C C C C C C H H H H H H H H
charge: -0.442609 -0.291352 -0.244345 -0.142803 -0.401671 -0.369753 -0.090157 0.136268 -0.445310 0.131615 0.219373 0.123510 -0.273364 -0.199926 0.250758 0.261514 0.226714 0.197906 0.368278 0.344762 0.273450 0.367143
chargesum: 0.00000
title: Mulliken charges with hydrogens summed into heavy atoms:
elementType: O O O N N N N C C C C C C C
charge: -0.075467 -0.291352 -0.244345 -0.142803 -0.033393 -0.024991 -0.090157 0.136268 0.066962 0.131615 0.219373 0.123510 0.151255 0.073524
polarizability: 1.39499989e+02 -1.70565420e+00 1.31472856e+02 1.16353706e+01 2.43329097e+00 6.02236850e+01
1716.lowfreq: -11.1168 -5.4401 -2.3112 0.0004 0.0006 0.0008 41.0611 68.9118 128.1596
frequency: 40.9993 68.9062 128.1503 151.6765 172.2144 189.3793 235.2434 284.2811 305.2839 360.9041 378.6582 417.9568 455.4952 499.3765 541.6084 586.5830 598.2441 643.4860 675.5986 681.4327 699.0784 702.6368 735.3884 766.2225 815.8290 841.5519 903.2507 926.8609 962.5607 1047.3179 1051.4781 1089.8275 1100.3900 1141.3749 1188.6826 1209.8594 1242.0441 1263.2602 1295.1095 1336.2348 1353.1600 1370.5143 1379.4784 1384.4398 1395.5505 1404.9440 1443.1585 1478.7903 1521.3556 1572.2715 1627.6439 1672.8600 2949.8507 3028.9565 3064.1251 3099.8484 3251.6025 3480.2402 3528.6887 3585.9457
redmass: 8.2041 6.6451 3.5600 6.7784 7.7050 4.7557 5.4407 5.1851 3.7809 8.8324 4.6778 2.7850 1.3819 5.8620 3.7469 5.7893 3.7441 2.8717 5.0749 1.2287 4.3280 4.3139 3.2145 2.7952 1.4411 2.8327 5.8574 2.6636 3.7352 3.4314 3.2576 1.8533 2.0226 3.8982 2.4555 1.2864 2.1607 2.5385 3.0962 1.5457 1.7443 1.8525 2.2941 1.7701 1.3616 2.8973 1.1133 1.0855 4.9505 8.3973 7.2699 7.6177 1.0693 1.0604 1.0940 1.1049 1.0996 1.0669 1.0770 1.0828
irintensity: 13.0674 0.5463 3.5768 9.5581 6.6783 3.4994 20.3388 18.9187 18.5100 17.0665 4.2586 35.1879 302.0294 8.7192 23.4688 6.1298 2.7185 57.0047 15.2577 65.6328 2.5555 10.5862 38.7433 97.5048 17.5578 10.1240 1.4306 20.8872 6.4666 18.5262 29.4606 32.8054 52.2156 27.7664 27.7916 9.8253 24.0111 2.7250 41.7718 67.4977 40.7660 23.1388 83.8583 4.9404 63.9796 53.8073 26.2187 4.1906 46.6323 22.8519 533.0915 628.5355 89.1381 17.3783 26.5865 4.5074 2.1119 49.5536 73.8080 100.0543
temp: 298.150 k
press: 1.00000 atm
elementType: 8 8 8 7 7 7 7 6 6 6 6 6 6 6 1 1 1 1 1 1 1 1
symmnumber: 1
zpe: 426635.4 jmol-1
zpe.correction: 0.162497 hartree
zpe.thermalcorrener: 0.174193 hartree
zpe.thermalcorrenthalpy: 0.175137 hartree
zpe.thermalcorrgfe: 0.124205 hartree
zpe.sumelectzpe: -715.232055 hartree
zpe.sumelectthermal: -715.220358 hartree
zpe.sumelectthermalent: -715.219414 hartree
zpe.sumelectthermalfe: -715.270347 hartree
dipole: 2.9464 -3.7290 -1.7090
dipole: 5.0505
quadrupole: -79.7228 -81.3838 -85.1128
quadrupole: -8.6629 6.9517 -1.0947
quadrupole: 2.3504 0.6893 -3.0397 -8.6629 6.9517 -1.0947
hfenergy: -715.3945514 hartree
pointgroup: C01 [X(C7H8N4O3)]
dipole: -1.1664891 -1.4437858 0.7092776 debye
dipolederiv: -0.7238847 -0.0028955 0.1226708 0.0584275 -0.5995836 0.212822 0.1508924 0.1442796 -0.3927683 -1.2706532 -0.3998477 -0.076776 -0.3910284 -0.8147155 -0.0754212 -0.0642374 -0.1115395 -0.4255793 -1.0737155 0.4300187 -0.155011 0.4158912 -0.8595993 0.1102816 -0.1826992 0.1253699 -0.4052754 -0.9993834 0.0244754 -0.0836308 -0.5059432 -0.8845769 -0.0882935 -0.0912069 0.0665632 -0.2080175 -1.3686388 -0.0167579 -0.1581513 0.0135845 -0.4118452 -0.0049786 -0.1999777 -0.010668 -0.3816776 -0.6548568 0.0907191 -0.0854278 0.0814877 -0.0877146 0.0107999 -0.1004459 0.0108418 -0.2185747 -0.6024232 -0.0975093 -0.0563146 -0.3257345 -0.4424285 -0.0304965 -0.0487346 -0.0096881 -0.255027 1.0088844 0.1349756 0.1302738 0.5738789 0.4593236 0.0632157 0.1406618 -0.002964 0.1107079 0.4817085 -0.2345849 0.0788444 -0.2423361 0.1805535 0.008577 0.1487494 -0.0244566 0.1244826 -0.027484 0.1911486 -0.0041745 0.490961 -0.8271 0.1480861 -0.0362889 0.0981775 -0.0459971 1.6551177 0.2818877 0.1794265 0.4104551 1.4330885 0.0122713 0.171481 0.0085653 0.3458176 1.6194555 -0.2818118 0.2686899 -0.3117462 1.4893549 -0.1425961 0.2998259 -0.1426466 0.351177 0.3882029 0.0353267 -0.0415151 -0.0101698 0.5310522 -0.1497567 -0.0313021 -0.125914 0.3003744 0.5670448 -0.1249299 0.1389336 -0.1692935 0.0972074 -0.04802 0.1488432 -0.0320767 -0.0173942 0.0684455 -0.037499 0.0714711 0.0326997 -0.0044119 0.0822761 0.0472434 0.0596305 0.0601261 -0.0164983 0.0180821 -0.0457163 -0.0410597 0.0427953 -0.1220208 -0.0285136 -0.0416353 0.0382869 0.0393818 -0.1074101 -0.0588645 -0.0488133 -0.0306405 -0.0414895 -0.0480946 -0.0642142 -0.0172959 -0.1681914 0.1562026 -0.0693373 0.0987888 -0.0498446 0.0756942 -0.0491719 0.088126 -0.0014751 0.1437867 -0.0041613 -0.0385247 -0.0067707 0.2623586 0.0098357 -0.0338697 0.0117348 0.3286173 0.2953154 0.0080889 -0.0171511 0.0362494 0.2041027 0.0186908 -0.0185128 0.0133571 0.3527701 0.0641979 -0.046207 -0.0225319 -0.0518193 0.0714147 -0.0021946 -0.023528 -0.0024465 0.1865295 0.5741883 -0.0173109 -0.0771832 -0.1077091 0.2412091 -0.047283 -0.1511138 -0.058396 0.1701928 unknown
polarizability: 139.6642205|1.8558367|131.312693|11.0978595|-3.9963574|60.2196163 unknown
InChI: InChI=1S/C7H8N4O3/c12-2-1-11-5-4(8-3-9-5)6(13)10-7(11)14/h3,8,10,12H,1-2H2
charge 0 multiplicity 1
22 atoms
O  3.236054 -0.008982 -1.266538
O  1.948425 1.92511 0.48665
O  -2.652916 2.052571 -0.464337
N  0.817389 -0.133495 0.450276
N  -0.348427 1.911804 0.035083
N  -2.544793 -1.083867 -0.217693
N  -0.603593 -2.162819 0.28619
C  -0.386926 -0.79036 0.227874
C  2.060366 -0.874458 0.775056
C  -1.568161 -0.093887 -0.079733
C  0.87496 1.269251 0.328645
C  -1.64069 1.343048 -0.198059
C  2.916573 -1.190729 -0.469018
C  -1.925276 -2.30138 0.007329
H  1.768684 -1.812904 1.276051
H  2.633225 -0.243309 1.477096
H  2.379582 -1.877452 -1.145459
H  3.841642 -1.697233 -0.115969
H  -0.282127 2.93175 -0.043144
H  -3.523762 -0.911637 -0.44759
H  -2.447761 -3.253365 -0.037392
H  3.301931 0.786542 -0.671417
