program: Gaussian 09
title: 000210369
version: EM64L-G09RevD.01
frameworkgroup: C1[X(C12H18ClNO4S2)]
method: RPBEPBE
basis: SDD
operation: Freq
keyword: #p
keyword: freq=noraman
keyword: PBEPBE/SDD
title: #p freq=noraman PBEPBE/SDD
converged: YES YES NO NO
title: Mulliken charges:
elementType: Cl S S O O O O N C C C C C C C C C C C C H H H H H H H H H H H H H H H H H H
charge: -0.066588 0.103374 0.969881 -0.265427 -0.557915 -0.491866 -0.501371 -0.281137 -0.382606 -0.362275 -0.393690 -0.308533 -0.267953 -0.762228 0.368505 -0.329776 -0.363511 -0.205410 -0.185393 -0.117547 0.217922 0.186794 0.201041 0.219833 0.216368 0.215752 0.206498 0.209098 0.269593 0.221081 0.230182 0.308814 0.299664 0.252968 0.256613 0.252493 0.256379 0.380375
chargesum: 0.00000
title: Mulliken charges with hydrogens summed into heavy atoms:
elementType: Cl S S O O O O N C C C C C C C C C C C C
charge: -0.066588 0.103374 0.969881 -0.265427 -0.177540 -0.491866 -0.501371 -0.011545 0.022110 0.058599 0.038430 0.107063 0.183310 -0.153750 0.368505 -0.076808 -0.106897 0.047083 0.070986 -0.117547
polarizability: 4.75342752e+02 1.31652740e+01 1.76231864e+02 1.93219555e+01 -4.91233339e+00 1.51485753e+02
1716.lowfreq: -1.6113 0.0004 0.0005 0.0021 1.6477 7.4115 12.8617 16.4777 19.5784
frequency: 12.6097 15.8541 19.4597 27.4252 31.4533 44.7451 66.1557 81.9626 87.7111 117.1226 122.0800 128.7319 134.1250 146.3901 152.5554 161.5465 171.3220 188.6968 213.0277 240.9003 244.8715 280.8438 301.4120 306.3645 315.2201 317.5081 387.4080 402.6803 412.2132 415.5226 480.9447 499.1944 500.1510 525.6110 616.5249 622.6693 639.7513 696.6826 700.0215 742.8137 752.4167 793.1062 799.1602 817.3066 824.8505 828.4436 924.5208 932.6393 934.3333 952.9879 968.2867 981.4418 990.5197 1022.5245 1035.3967 1058.9558 1066.6761 1069.6633 1071.7629 1108.0609 1109.6634 1114.9436 1151.0685 1159.0095 1174.0360 1191.0509 1220.9500 1240.2182 1251.2448 1273.4893 1284.5884 1289.8870 1289.9701 1293.4426 1321.3798 1350.5802 1368.4040 1383.2482 1388.8794 1405.3209 1419.8234 1456.9155 1468.8074 1470.0863 1474.2050 1481.8689 1488.7649 1493.1674 1584.5988 1604.8694 2877.9620 2918.0040 2945.1146 2958.0555 2963.6835 2996.2629 3002.1896 3003.5714 3027.5806 3030.2400 3055.7500 3065.9313 3156.8270 3158.6149 3175.3650 3179.3831 3452.6531 3453.9181
redmass: 8.6182 5.1693 9.5312 5.0048 8.1664 5.1082 3.7208 3.4494 2.4248 3.4661 5.5121 2.6202 4.6535 2.3067 3.6757 5.1340 3.1535 2.1012 4.0613 5.5993 4.5761 8.6891 5.5818 6.2081 5.3555 7.1077 6.3431 12.2904 4.4238 3.0129 4.0610 2.8307 3.8033 17.1947 1.3068 6.5171 7.5022 3.4469 4.8296 1.2125 1.0778 6.5127 1.2695 1.1813 1.5434 14.5843 1.2897 1.2753 9.0892 1.3394 4.9155 2.2288 3.9333 2.7238 3.1911 1.2590 2.9702 2.5743 2.6659 1.9014 1.6458 1.3319 1.8214 2.0013 1.1817 1.4202 4.0308 1.2302 1.2442 1.2650 1.0604 1.1759 1.2199 1.1202 1.2700 1.3956 4.0991 1.4254 1.6544 3.7853 1.0802 1.2421 1.4745 1.0896 1.3209 1.1375 1.1215 1.1089 7.4302 6.6272 1.0703 1.0692 1.0552 1.0634 1.0635 1.0624 1.1058 1.0837 1.0905 1.0998 1.0983 1.1049 1.0878 1.0884 1.0965 1.0977 1.0672 1.0737
irintensity: 0.4954 1.2551 0.7902 0.3714 0.7083 0.6999 1.1399 0.2881 0.1038 13.3258 0.1711 11.9724 7.4882 0.3979 2.7687 8.2935 7.7974 65.6091 57.7267 4.2694 10.8575 30.0592 4.9660 11.8176 11.6019 2.4493 27.3928 40.6354 18.1625 0.0822 27.2176 17.0337 26.4725 188.9713 242.0189 1.6607 69.2653 0.5373 2.2877 10.1623 11.2171 1.5604 15.1183 6.6051 69.0721 93.5242 4.6764 3.2817 80.0892 0.2573 59.1799 23.4871 40.9899 3.2588 9.4302 62.4100 3.0978 0.1624 48.3233 7.9259 7.7515 42.9178 11.3255 14.1492 65.6535 104.0721 318.5066 19.9286 2.9424 23.6606 0.1927 2.2953 0.2244 18.9906 26.3471 3.1717 0.6503 115.9721 26.1286 1.2497 15.7075 45.1555 146.2649 16.1613 74.1244 9.5679 19.5342 10.6489 17.6899 30.2130 90.4018 33.7743 29.3834 3.4358 23.7406 17.2708 29.9686 30.3262 20.7830 14.6263 7.6967 74.9583 10.7702 1.4828 9.9764 0.8969 91.1054 19.0093
temp: 298.150 k
press: 1.00000 atm
elementType: 17 16 16 8 8 8 8 7 6 6 6 6 6 6 6 6 6 6 6 6 1 1 1 1 1 1 1 1 1 1 1 1 1 1 1 1 1 1
symmnumber: 1
zpe: 754430.5 jmol-1
zpe.correction: 0.287347 hartree
zpe.thermalcorrener: 0.311476 hartree
zpe.thermalcorrenthalpy: 0.312421 hartree
zpe.thermalcorrgfe: 0.227431 hartree
zpe.sumelectzpe: -2078.149933 hartree
zpe.sumelectthermal: -2078.125804 hartree
zpe.sumelectthermalent: -2078.124860 hartree
zpe.sumelectthermalfe: -2078.209850 hartree
dipole: -0.9499 -0.9552 0.2364
dipole: 1.3677
quadrupole: -216.1188 -142.6473 -138.2228
quadrupole: -7.1202 8.1717 -2.8205
quadrupole: -50.4559 23.0157 27.4402 -7.1202 8.1717 -2.8205
hfenergy: -2078.4372806 hartree
pointgroup: C01 [X(C12H18Cl1N1O4S2)]
dipole: 0.3792082 0.363834 0.1155468 debye
polarizability: 475.9562293|9.0642516|175.2350439|-16.4451855|6.5892848|151.8690962 unknown
InChI: InChI=1S/C12H17ClNOS.HO3S/c13-11-3-5-12(6-4-11)15-9-2-1-7-14-8-10-16;1-4(2)3/h3-6,14H,1-2,7-10H2;1H
charge 0 multiplicity 1
38 atoms
Cl 9.127933 -1.042623 -0.113951
S  -6.689216 0.947936 -1.362298
S  -7.730782 -0.546535 0.314921
O  3.419465 0.839769 0.394878
O  -7.686908 0.660851 1.730569
O  -9.277305 -0.946007 0.065025
O  -6.657038 -1.725484 0.627951
N  -2.724734 0.147346 -0.502026
C  -0.244812 0.08117 -0.312765
C  -1.535262 0.870197 -0.015725
C  1.016064 0.821224 0.187459
C  2.29411 0.03623 -0.115792
C  -4.021504 0.833214 -0.415426
C  -5.030781 0.087388 -1.307152
C  4.715859 0.327569 0.23738
C  5.021652 -0.915491 -0.37208
C  5.757434 1.14907 0.73888
C  6.369775 -1.331604 -0.477125
C  7.09905 0.735534 0.633868
C  7.388422 -0.504028 0.024879
H  -0.183074 -0.095357 -1.40417
H  -0.306215 -0.916957 0.170866
H  -1.591003 1.08895 1.079219
H  -1.498866 1.850013 -0.53167
H  0.953609 0.99221 1.279112
H  1.088421 1.816217 -0.2917
H  2.282693 -0.953319 0.38812
H  2.414138 -0.122284 -1.208233
H  -2.760445 -0.833845 -0.195746
H  -3.888616 1.868342 -0.783382
H  -4.431612 0.905427 0.618689
H  -5.213205 -0.935553 -0.915622
H  -4.673311 -0.004734 -2.349486
H  4.236245 -1.566086 -0.766375
H  5.498485 2.104146 1.205047
H  6.614879 -2.289307 -0.945468
H  7.905353 1.36655 1.018441
H  -8.3702 0.357165 2.40029
