program: Gaussian 09
title: 000208014
version: EM64L-G09RevD.01
frameworkgroup: C1[X(C9H11NOS)]
method: RPBEPBE
basis: SDD
operation: Freq
keyword: #p
keyword: freq=noraman
keyword: PBEPBE/SDD
title: #p freq=noraman PBEPBE/SDD
converged: YES YES NO NO
title: Mulliken charges:
elementType: S O N C C C C C C C C C H H H H H H H H H H H
charge: 0.150133 -0.431510 -0.329121 -0.595042 -0.341084 -0.642375 0.571288 -0.431177 -0.332364 -0.381074 -0.341689 0.280510 0.271751 0.202404 0.228383 0.281367 0.267229 0.246562 0.233848 0.270332 0.218809 0.249542 0.353278
chargesum: 0.00000
title: Mulliken charges with hydrogens summed into heavy atoms:
elementType: S O N C C C C C C C C C
charge: 0.150133 -0.078233 -0.047754 -0.323291 0.089703 -0.128585 0.571288 -0.197329 -0.062032 -0.162264 -0.092147 0.280510
polarizability: 1.85330204e+02 7.37329426e+00 1.05724647e+02 1.79085660e+00 8.33556664e+00 8.54094447e+01
1716.lowfreq: -15.0072 -2.1030 -0.0018 0.0013 0.0017 7.6684 42.0334 72.0144 76.4297
frequency: 41.9982 71.9966 76.4027 168.7814 179.3889 271.3867 283.9675 318.3589 365.9610 385.9409 393.3125 417.1924 469.6189 501.7805 548.4671 561.4722 627.2131 651.0632 703.0807 735.2329 773.2727 806.2535 836.1158 844.0357 891.3144 930.6950 937.9940 973.3853 1000.5020 1005.8968 1027.1419 1098.1314 1132.1845 1142.0288 1153.0543 1171.9236 1189.3080 1192.9251 1215.4012 1248.6004 1271.0992 1289.0140 1328.4570 1346.8283 1396.2565 1402.6708 1431.0053 1450.9249 1474.5386 1504.2043 1597.8562 1624.2353 2891.6836 2918.5947 3034.8398 3047.9347 3110.0234 3121.4831 3134.2751 3151.1810 3172.8404 3515.0779 3581.4207
redmass: 4.2016 4.2811 4.8319 4.0026 5.1822 3.3654 3.7877 1.9718 1.1018 2.4769 3.7822 2.7803 6.0825 4.1138 2.9344 5.0361 6.8305 4.0022 3.5878 3.8013 4.2540 1.3675 3.9305 1.5393 1.7890 1.5192 2.2639 1.3550 2.2898 1.9947 1.7060 1.4009 2.6410 1.3761 1.5157 1.1171 1.1349 1.2781 1.8366 2.9490 1.1994 1.5119 1.3574 1.4443 1.3994 5.2015 2.6421 1.0961 1.0951 2.8243 6.5522 6.3981 1.0703 1.0849 1.0760 1.0706 1.0872 1.1103 1.0965 1.0881 1.0970 1.0766 1.0660
irintensity: 1.6399 1.2468 2.5206 0.3726 7.7047 8.0006 3.4149 87.3287 140.5984 52.3254 12.6258 7.9654 2.4046 8.9742 36.9491 7.1576 3.5695 4.1500 15.3266 4.8006 12.2203 26.9122 19.9199 37.4737 6.9200 1.7543 3.8448 0.2169 4.5713 1.5940 13.8033 54.2196 2.3195 246.1675 11.7825 17.3170 10.7646 9.6194 1.0466 32.1349 17.4559 61.5714 23.2000 6.8659 33.6982 23.9188 23.3657 6.5410 3.5735 64.5428 18.2850 63.3403 129.7816 59.0517 11.8527 63.0364 18.3304 19.1642 18.7582 2.9785 5.8690 2.7488 44.0961
temp: 298.150 k
press: 1.00000 atm
elementType: 16 8 7 6 6 6 6 6 6 6 6 6 1 1 1 1 1 1 1 1 1 1 1
symmnumber: 1
zpe: 479339.0 jmol-1
zpe.correction: 0.182571 hartree
zpe.thermalcorrener: 0.193790 hartree
zpe.thermalcorrenthalpy: 0.194734 hartree
zpe.thermalcorrgfe: 0.144765 hartree
zpe.sumelectzpe: -876.686428 hartree
zpe.sumelectthermal: -876.675208 hartree
zpe.sumelectthermalent: -876.674264 hartree
zpe.sumelectthermalfe: -876.724234 hartree
dipole: -0.3235 0.2557 2.9604
dipole: 2.9890
quadrupole: -64.9135 -76.2785 -79.4137
quadrupole: 12.4857 -0.8252 2.9857
quadrupole: 8.6218 -2.7432 -5.8785 12.4857 -0.8252 2.9857
hfenergy: -876.8689982 hartree
pointgroup: C01 [X(C9H11N1O1S1)]
dipole: 0.1766372 0.8756453 -0.7648261 debye
dipolederiv: -0.4754887 0.058304 -0.1130496 0.1176992 -0.2200821 0.0701109 -0.1570308 0.0516035 -0.2457164 -1.6177697 -0.2260187 -0.074263 -0.2999607 -0.148417 0.1014596 -0.066264 0.1054583 -0.3864373 -0.8166304 -0.0638708 -0.0130741 -0.0588911 -0.5063922 -0.1470999 -0.0157889 -0.0896201 -0.4659602 0.90905 -0.0583736 0.0543099 -0.0226122 0.4541621 -0.0606465 0.0909884 -0.0440833 0.6053611 0.5106602 0.1277312 0.0448957 0.1349252 0.3483573 -0.0435094 0.1677768 0.0623885 0.1536629 0.2074928 -0.0615876 -0.0221274 -0.1170087 0.1296096 0.1228399 -0.2142045 0.1398224 -0.0308745 -0.1500603 -0.0225668 0.0602191 -0.0548342 -0.2140166 -0.0436292 0.0885739 -0.0209621 -0.0881936 0.1806106 -0.0522853 -0.0286035 -0.0142771 0.084376 0.0698901 -0.0329858 0.0930609 -0.1098788 0.1249065 0.0481364 0.003796 0.0141687 0.0858331 0.0557211 0.018058 0.0492086 -0.091467 -0.3473345 -0.0317592 -0.0252483 -0.4190349 -0.080645 0.0298462 -0.1208833 0.0373669 -0.188362 -0.3811443 -0.0376989 -0.0188115 0.2290942 0.0543573 0.0718613 0.0752624 0.0695201 -0.1476175 1.5126075 0.1905401 0.0377131 0.2846486 0.1263577 0.0218188 0.0425216 0.0092515 0.0823604 -0.0491934 0.0204262 -0.0217628 0.0472478 -0.2229477 -0.0085525 -0.0022464 -0.0011008 -0.072279 -0.1347557 -0.0724431 0.0087986 -0.2157662 -0.1915409 0.0250556 -0.0913409 -0.0397108 0.0420686 -0.0233152 0.0284269 0.0717013 0.0457951 0.0556006 -0.0800519 0.1545388 -0.0675142 -0.0892281 0.1835027 0.0519898 0.0249226 0.1198359 0.2370041 0.167858 -0.049306 0.0519578 0.0722037 0.0165328 -0.0026885 0.0305353 0.0586343 -0.1367315 -0.0258282 0.0852563 -0.072849 0.0245488 -0.1773957 0.0128145 -0.0751894 0.0032757 0.0775893 -0.012348 -0.0240481 -0.0214083 0.0504692 0.0743311 -0.089169 -0.0189231 -0.0648832 -0.0546136 -0.0621746 -0.0253139 -0.0622795 0.117553 0.0734755 0.0861354 0.0288775 0.0962756 0.0339542 -0.0304551 0.0169917 -0.033195 0.1216361 -0.082426 0.1040611 0.0396371 0.0940749 0.0122728 -0.05569 0.0416434 -0.0565163 0.155868 0.0575756 -0.0556288 -0.0151754 -0.0675979 -0.025001 -0.0625363 -0.0153575 -0.0597068 0.1455795 0.4047686 0.0455248 0.0208219 0.0891909 0.1009135 -0.1039399 0.0331588 -0.1006922 0.344703 unknown
polarizability: 185.3205406|-7.8022468|104.4927606|1.6351071|9.3791135|86.650995 unknown
InChI: InChI=1S/C9H11NOS/c11-8-3-1-7(2-4-8)9-10-5-6-12-9/h1-4,9-11H,5-6H2
charge 0 multiplicity 1
23 atoms
S  2.289964 -0.117268 1.612729
O  -4.219856 -0.509381 -0.139008
N  2.140625 0.156132 -1.056569
C  1.392649 0.711164 0.068948
C  3.584949 0.098068 -0.796184
C  3.724691 -0.708347 0.515109
C  -0.083809 0.408474 0.013774
C  -1.031188 1.394783 0.376556
C  -0.55039 -0.87104 -0.390517
C  -2.416534 1.121628 0.338941
C  -1.925641 -1.156744 -0.439839
C  -2.859759 -0.157895 -0.071611
H  1.561833 1.797529 0.238212
H  4.051323 1.102461 -0.654562
H  4.097239 -0.409064 -1.633979
H  1.829731 0.456819 -1.984961
H  3.608849 -1.788039 0.336566
H  4.672908 -0.498383 1.034662
H  -0.68721 2.387147 0.693295
H  0.187421 -1.632771 -0.661501
H  -3.140119 1.896976 0.622938
H  -2.298034 -2.138288 -0.747991
H  -4.792645 0.24294 0.152189
