program: Gaussian 09
title: 000210350
version: EM64L-G09RevD.01
frameworkgroup: C1[X(C12H18ClNO3S2)]
method: RPBEPBE
basis: SDD
operation: Freq
keyword: #p
keyword: freq=noraman
keyword: PBEPBE/SDD
title: #p freq=noraman PBEPBE/SDD
converged: YES YES NO NO
title: Mulliken charges:
elementType: Cl S S O O O N C C C C C C C C C C C C H H H H H H H H H H H H H H H H H H
charge: -0.057749 0.103728 0.969713 -0.557257 -0.492031 -0.501395 -0.284278 -0.219999 -0.411055 -0.385575 0.538903 -0.693941 -0.264262 -0.454648 -0.384831 -0.766393 -0.203386 -0.230183 -0.114969 0.193061 0.229764 0.213892 0.195410 0.232826 0.269072 0.229164 0.219495 0.205116 0.228980 0.221730 0.239576 0.234289 0.298471 0.308277 0.255719 0.254168 0.380600
chargesum: 0.00000
title: Mulliken charges with hydrogens summed into heavy atoms:
elementType: Cl S S O O O N C C C C C C C C C C C C
charge: -0.057749 0.103728 0.969713 -0.176657 -0.492031 -0.501395 -0.015206 -0.026939 0.032602 0.042661 0.538903 -0.040166 0.186447 -0.215073 -0.150543 -0.159645 0.052333 0.023986 -0.114969
polarizability: 4.46719745e+02 -1.30632788e+01 1.75284662e+02 9.02953158e+00 -1.05518155e+01 1.78899530e+02
1716.lowfreq: -10.4422 -2.6761 -0.0009 0.0013 0.0022 5.0267 11.5380 19.1329 26.4867
frequency: 9.7480 17.9046 26.4526 28.2305 37.0191 43.0541 56.4777 92.4753 105.9505 120.8481 129.4132 143.9817 154.3604 172.4296 186.2188 189.3470 201.3728 215.7385 240.4542 248.2051 282.4310 287.2005 306.4214 320.1078 338.2400 349.8830 403.7333 409.1990 410.0736 460.2377 505.5781 524.9951 544.0939 624.9683 626.6153 647.3413 700.8175 722.8356 742.4909 749.2475 815.8659 828.0035 829.9752 833.1258 849.1918 933.6306 948.1439 953.0178 964.8083 985.9957 999.0739 1018.3208 1035.3175 1048.7575 1059.4121 1068.6521 1074.3823 1097.5662 1102.0158 1117.3289 1151.4935 1161.6291 1185.2094 1206.2138 1222.3542 1237.5841 1267.3496 1282.8565 1291.9533 1303.6059 1310.2622 1331.5013 1338.0960 1372.7856 1380.4212 1390.8237 1401.1770 1420.1734 1454.6828 1470.2978 1472.0507 1476.8500 1477.4004 1484.9281 1486.7105 1585.8153 1599.1931 2895.1601 2918.6403 2950.7255 2957.0054 2975.8518 2978.5028 3007.8294 3026.2583 3035.5183 3056.0905 3070.5830 3079.0913 3128.7285 3130.5959 3167.1923 3170.2903 3446.3256 3453.2808
redmass: 8.9118 5.3694 7.0457 5.8816 4.9599 5.7259 3.6264 2.7236 2.9259 3.4397 5.1196 4.9735 3.2676 2.0384 2.4530 3.0212 3.0197 4.7999 1.4353 4.0326 3.6896 9.8886 6.2086 4.6108 3.8228 5.8795 13.2279 2.9446 3.7810 5.1849 2.8504 14.9202 2.7836 2.0830 3.0033 2.7395 4.7409 3.0951 1.2372 2.2943 1.5442 14.2989 1.2995 1.5162 2.1821 9.3602 1.3539 1.3439 1.3743 1.7187 4.2116 3.9766 1.9291 2.4147 1.2624 2.6086 2.4589 1.6855 2.2570 1.4070 3.8007 1.3940 1.1229 2.0739 1.3539 1.2928 1.2008 1.2643 1.1467 1.2536 1.3078 1.4432 1.5563 1.5611 3.8529 1.2213 2.1426 1.0780 1.2288 1.0862 1.1352 1.5479 1.2922 1.0623 1.0823 7.1728 6.3325 1.0689 1.0691 1.0817 1.0636 1.0360 1.0627 1.0908 1.0904 1.0990 1.0979 1.0997 1.0999 1.0894 1.0893 1.0950 1.0960 1.0747 1.0660
irintensity: 0.5827 0.0048 1.0506 0.2635 0.3407 0.9551 0.3828 1.5089 5.6494 16.7799 6.2675 6.3498 2.5173 5.1961 33.4908 45.4871 0.2024 58.2852 0.7133 14.8118 0.1761 23.1174 13.2550 5.6493 26.1077 1.4983 45.0481 0.3892 3.1608 23.0758 15.2660 232.6515 67.5333 136.5649 61.7668 45.2267 1.3076 3.3666 10.5445 3.3999 45.1063 90.4366 11.1231 40.7170 4.4588 74.1535 4.6355 28.4132 0.5239 4.0946 48.3492 1.2280 5.6054 9.0033 54.6796 4.6944 46.7436 52.2448 1.2783 30.5670 21.4486 30.0557 0.1490 24.5664 62.1066 9.6818 44.2971 4.5754 13.9609 10.6596 18.0653 9.2144 1.5404 45.1986 7.7052 12.8279 11.8795 14.6372 31.6412 15.6068 7.9890 74.6585 12.1020 10.3562 16.2028 0.6916 5.6433 66.1344 34.7904 10.8712 4.2137 40.7300 23.6218 33.9503 21.5315 25.8966 7.3299 56.6715 55.3234 10.9507 14.9474 6.9779 0.6643 42.7937 70.0615
temp: 298.150 k
press: 1.00000 atm
elementType: 17 16 16 8 8 8 7 6 6 6 6 6 6 6 6 6 6 6 6 1 1 1 1 1 1 1 1 1 1 1 1 1 1 1 1 1 1
symmnumber: 1
zpe: 742581.1 jmol-1
zpe.correction: 0.282834 hartree
zpe.thermalcorrener: 0.305943 hartree
zpe.thermalcorrenthalpy: 0.306887 hartree
zpe.thermalcorrgfe: 0.224785 hartree
zpe.sumelectzpe: -2003.021873 hartree
zpe.sumelectthermal: -2002.998764 hartree
zpe.sumelectthermalent: -2002.997820 hartree
zpe.sumelectthermalfe: -2003.079921 hartree
dipole: -2.1940 0.8472 -0.2412
dipole: 2.3643
quadrupole: -184.8680 -133.3310 -132.3503
quadrupole: -10.3479 -3.8639 -3.5633
quadrupole: -34.6849 16.8521 17.8328 -10.3479 -3.8639 -3.5633
hfenergy: -2003.3047067 hartree
pointgroup: C01 [X(C12H18Cl1N1O3S2)]
dipole: 0.8726941 0.3096588 0.0880019 debye
polarizability: 447.401262|6.002507|174.5550792|6.1592663|10.1928925|178.9475961 unknown
InChI: InChI=1S/C12H17ClNS.HO3S/c1-2-10(9-14-7-8-15)11-3-5-12(13)6-4-11;1-4(2)3/h3-6,10,14H,2,7-9H2,1H3;1H
charge 0 multiplicity 1
37 atoms
Cl 6.793527 -2.179916 0.161835
S  -4.892282 0.461573 1.510638
S  -5.974304 -0.753944 -0.356993
O  -5.607173 -2.468674 0.263645
O  -7.580632 -0.615386 -0.47688
O  -5.06507 -0.489916 -1.67788
N  -1.049707 0.552325 -0.015778
C  1.41024 0.808543 -0.41601
C  0.283654 0.00902 0.301999
C  1.469379 2.278629 0.088646
C  2.746386 0.077933 -0.274457
C  2.3777 3.184334 -0.768326
C  -2.193562 0.045532 0.755224
C  3.412478 -0.450882 -1.408293
C  3.350808 -0.099167 0.998616
C  -3.401392 0.96555 0.501173
C  4.642978 -1.137523 -1.289734
C  4.577802 -0.782731 1.141591
C  5.206647 -1.293911 -0.010438
H  1.156141 0.836663 -1.498182
H  0.373723 -1.070088 0.031709
H  0.422749 0.074005 1.399487
H  1.821945 2.286474 1.139929
H  0.436196 2.674576 0.100292
H  -1.234483 0.605888 -1.026585
H  3.420172 2.817401 -0.779263
H  2.386564 4.218336 -0.378338
H  2.023546 3.224405 -1.8162
H  -2.477922 -1.004244 0.51093
H  -1.922814 0.06552 1.828035
H  2.969542 -0.325494 -2.403538
H  2.867468 0.302463 1.897093
H  -3.179787 2.020582 0.746942
H  -3.706843 0.918031 -0.565523
H  5.14947 -1.538825 -2.17221
H  5.035951 -0.914149 2.126249
H  -6.260197 -3.09003 -0.178103
