program: Gaussian 09
title: 000210345
version: EM64L-G09RevD.01
frameworkgroup: C1[X(C14H29NO4S2)]
method: RPBEPBE
basis: SDD
operation: Freq
keyword: #p
keyword: freq=noraman
keyword: PBEPBE/SDD
title: #p freq=noraman PBEPBE/SDD
converged: YES YES NO NO
title: Mulliken charges:
elementType: S S O O O O N C C C C C C C C C C C C C C H H H H H H H H H H H H H H H H H H H H H H H H H H H H H
charge: 0.097963 0.970037 -0.272190 -0.558993 -0.496236 -0.503373 -0.279434 0.026011 -0.450768 -0.443929 -0.402846 -0.402837 -0.382167 -0.449850 -0.277121 -0.251360 -0.383394 -0.388092 -0.362034 -0.265345 -0.763257 0.184966 0.190100 0.202508 0.198639 0.190808 0.197082 0.189384 0.191694 0.197226 0.188089 0.198949 0.213088 0.210069 0.194372 0.183265 0.180593 0.179062 0.207904 0.211091 0.214542 0.186044 0.202528 0.220099 0.270856 0.229559 0.220667 0.297945 0.309081 0.379004
chargesum: 0.00000
title: Mulliken charges with hydrogens summed into heavy atoms:
elementType: S S O O O O N C C C C C C C C C C C C C C
charge: 0.097963 0.970037 -0.272190 -0.179989 -0.496236 -0.503373 -0.008578 0.210978 -0.058160 -0.054482 -0.016380 -0.013917 0.004871 -0.026693 0.100516 0.108295 0.035601 0.012493 0.060593 0.184881 -0.156231
polarizability: 4.61318011e+02 2.25531285e+01 1.95469546e+02 1.99360846e+01 4.93850934e+00 1.81867923e+02
1716.lowfreq: -20.5130 -5.7715 -1.7960 -0.0015 0.0004 0.0023 5.1795 7.9045 16.2005
frequency: -15.4331 7.1170 15.7486 19.3490 26.1525 35.8541 49.6630 57.0451 68.1412 89.1511 102.2460 107.7984 112.4125 122.1618 127.9681 134.8848 150.6448 153.5194 166.5807 184.4847 207.4413 213.9816 215.6969 236.1727 257.8204 285.6142 301.9210 306.7745 317.1014 364.7911 393.2041 401.8391 428.0810 430.3108 448.1320 477.3014 510.3752 523.9312 563.5660 609.9763 699.9280 744.4428 747.7592 763.0815 779.4249 793.7080 805.0017 826.8945 840.7999 869.0181 886.9808 907.9740 919.8921 922.1527 930.4711 961.3088 977.4085 992.9163 1019.9069 1024.6255 1044.1237 1052.1588 1055.4795 1057.1956 1065.5977 1070.3915 1070.7723 1087.3011 1098.9952 1111.2875 1114.0908 1116.0286 1144.4110 1154.9083 1159.6854 1180.1771 1188.0154 1193.1337 1237.0314 1242.0251 1245.9182 1256.0641 1257.2365 1268.3227 1274.9440 1277.4725 1279.5861 1283.2934 1290.6171 1310.3419 1311.8071 1319.0125 1332.9705 1337.3386 1338.8540 1339.8793 1345.4701 1360.0433 1361.9951 1381.0579 1407.6338 1420.8379 1454.0551 1454.3291 1459.9543 1460.8353 1463.3933 1468.7343 1469.4940 1471.6085 1475.7066 1478.7207 1484.0412 1490.2940 1494.7723 2878.1728 2899.1970 2911.0333 2915.1994 2928.7111 2946.9243 2951.6630 2955.3689 2956.7621 2960.2303 2962.6642 2962.7110 2963.6198 2964.1492 2980.0575 2992.0455 3001.3845 3015.3868 3020.6688 3023.5158 3025.2787 3026.9874 3027.1135 3037.9561 3043.9968 3054.0916 3059.7145 3453.5563 3457.7520
redmass: 3.7997 6.1579 5.6670 5.2126 6.6091 3.2734 2.4728 3.4695 3.4239 2.2410 2.9179 2.8577 4.1949 5.6138 2.3110 2.1553 5.0587 2.6962 2.6187 1.9970 3.3302 1.8786 3.8051 4.8990 5.3651 8.0494 3.7312 4.1089 2.0906 4.2670 3.2016 12.5278 2.1246 3.0116 3.2195 2.3268 3.2738 15.5966 2.0757 1.2886 4.3642 1.2382 1.0807 1.9641 1.4579 1.4267 1.1635 15.3706 2.0314 1.6992 1.6352 2.0327 3.4161 1.3149 9.1778 2.2677 1.9653 1.4541 2.4592 3.9742 3.2326 1.7919 1.1734 1.2560 2.3864 4.2690 2.5773 1.7350 2.4096 2.3912 1.3892 2.4069 1.4916 2.9486 1.8542 1.4346 1.4362 1.4193 1.2414 1.2651 1.2615 1.2197 1.2607 1.2472 1.2051 1.1362 1.1530 1.1287 1.1172 1.2834 1.2430 1.3035 1.3762 1.4647 1.4798 1.5478 1.4101 1.4700 1.5170 1.4476 1.4880 1.0791 1.2441 1.0912 1.0886 1.0896 1.0851 1.0819 1.0697 1.0850 1.0945 1.0904 1.0868 1.0810 1.0857 1.0701 1.0549 1.0563 1.0692 1.0810 1.1053 1.0635 1.0635 1.0674 1.0903 1.0637 1.0657 1.0611 1.0667 1.0600 1.0611 1.0843 1.0968 1.0998 1.0901 1.0948 1.1013 1.0993 1.1039 1.1025 1.0980 1.1041 1.0661 1.0748
irintensity: 0.1538 0.2853 0.3892 0.3039 0.9230 0.8227 1.5181 1.4257 1.0983 0.5843 2.1932 1.3948 20.7010 11.6651 1.0727 2.2729 4.4044 7.8562 0.8950 65.3010 33.9527 0.1865 16.1890 14.2125 36.1461 8.8741 4.6364 12.5853 4.6514 12.3979 2.6707 41.9900 9.5408 6.3841 18.1302 32.2674 26.3901 188.4369 19.6241 224.6239 1.3874 7.4134 9.4828 0.8047 0.1879 1.0068 6.5298 92.8309 5.7491 1.6150 9.4901 4.1683 7.5510 12.7898 77.9218 6.4445 3.7371 7.2342 32.3196 14.3358 37.2512 9.0957 8.6206 67.9875 60.0341 98.9448 0.3223 1.4432 0.7086 3.2755 34.3217 0.6005 1.4436 13.3117 6.6880 13.5085 59.1040 29.7159 19.9116 0.4906 4.1363 1.2955 2.1394 9.8573 1.0089 2.3943 0.6580 6.1227 19.5916 0.3899 0.4396 11.4201 0.9063 10.0316 2.4995 6.8397 10.4376 9.7898 46.5463 75.4397 2.1090 15.0252 34.9585 1.0201 4.8445 10.0462 7.4455 20.6718 4.0519 8.0768 1.2803 2.3055 0.6823 12.7311 12.1850 78.5112 39.4896 90.7370 34.5712 12.7045 53.9546 18.6800 3.7071 49.2029 51.7317 42.3409 18.7814 28.2378 31.6310 34.9235 24.9001 31.7633 91.5607 42.4614 20.5681 59.0059 18.8094 12.8756 67.7456 125.7877 6.9241 84.7150 78.1069 34.4324
temp: 298.150 k
press: 1.00000 atm
elementType: 16 16 8 8 8 8 7 6 6 6 6 6 6 6 6 6 6 6 6 6 6 1 1 1 1 1 1 1 1 1 1 1 1 1 1 1 1 1 1 1 1 1 1 1 1 1 1 1 1 1
symmnumber: 1
zpe: 1104057.5 jmol-1
zpe.correction: 0.420513 hartree
zpe.thermalcorrener: 0.446856 hartree
zpe.thermalcorrenthalpy: 0.447800 hartree
zpe.thermalcorrgfe: 0.357844 hartree
zpe.sumelectzpe: -1700.724782 hartree
zpe.sumelectthermal: -1700.698439 hartree
zpe.sumelectthermalent: -1700.697495 hartree
zpe.sumelectthermalfe: -1700.787451 hartree
dipole: -5.2084 -0.0517 -0.3460
dipole: 5.2201
quadrupole: -188.3923 -148.2449 -142.1353
quadrupole: -7.3027 14.0841 3.9344
quadrupole: -28.8015 11.3460 17.4555 -7.3027 14.0841 3.9344
hfenergy: -1701.145295 hartree
pointgroup: C01 [X(C14H29N1O4S2)]
dipole: 2.047577 -0.0709366 -0.1425687 debye
polarizability: 461.1409434|7.0648517|188.0166531|-30.1455119|-8.1100054|189.4978831 unknown
InChI: InChI=1S/C14H28NOS.HO3S/c17-13-10-15-9-4-5-11-16-12-8-14-6-2-1-3-7-14;1-4(2)3/h14-15H,1-13H2;1H
charge 0 multiplicity 1
50 atoms
S  -7.541637 0.952107 -1.180457
S  -8.605574 -0.328207 0.660539
O  2.626513 0.405154 0.072361
O  -8.440717 0.989907 1.966048
O  -10.182518 -0.655112 0.506188
O  -7.590633 -1.540714 1.036937
N  -3.588878 -0.033698 -0.48849
C  6.444801 0.176485 -0.118761
C  6.822198 -1.256804 0.344845
C  7.494216 1.197097 0.397221
C  8.26487 -1.639167 -0.06566
C  8.935532 0.819786 -0.016289
C  9.295366 -0.609379 0.454496
C  5.022816 0.599663 0.326875
C  3.895659 -0.263491 -0.250873
C  1.453926 -0.350186 -0.377797
C  0.214567 0.483015 -0.034896
C  -1.102495 -0.220111 -0.43207
C  -2.335007 0.653296 -0.127549
C  -4.838786 0.72786 -0.375611
C  -5.948746 -0.024238 -1.13309
H  6.479778 0.191617 -1.232156
H  6.728368 -1.30842 1.450931
H  6.111072 -1.997986 -0.070245
H  7.242448 2.21017 0.024812
H  7.432944 1.240714 1.505732
H  8.510014 -2.651668 0.310522
H  8.326922 -1.685563 -1.173173
H  9.026073 0.872719 -1.12141
H  9.654422 1.553108 0.398553
H  9.307355 -0.63462 1.564238
H  10.3141 -0.881496 0.11596
H  4.83576 1.644995 0.010863
H  4.955941 0.585539 1.43296
H  3.899513 -1.287619 0.183663
H  4.000576 -0.358433 -1.356738
H  1.418126 -1.341184 0.131607
H  1.512747 -0.5339 -1.475635
H  0.295985 1.459506 -0.550391
H  0.224405 0.693981 1.051926
H  -1.099973 -0.466265 -1.511844
H  -1.187962 -1.182667 0.115725
H  -2.317771 0.953387 0.949236
H  -2.280366 1.590602 -0.715986
H  -3.653232 -0.992454 -0.122399
H  -5.170515 0.907096 0.673636
H  -4.678015 1.721512 -0.836065
H  -5.661711 -0.239643 -2.179065
H  -6.177541 -0.989108 -0.632683
H  -9.126233 0.791314 2.671857
