program: Gaussian 09
title: 000207980
version: EM64L-G09RevD.01
frameworkgroup: C1[X(C18H21N)]
method: RPBEPBE
basis: SDD
operation: Freq
keyword: #pfreq=noraman
keyword: PBEPBE/SDD
title: #p freq=noraman PBEPBE/SDD
converged: YES YES NO NO
title: Mulliken charges:
elementType: N C C C C C C C C C C C C C C C C C C H H H H H H H H H H H H H H H H H H H H H
charge: -0.047352 0.113317 -0.505546 -0.487791 -0.399276 -0.396309 0.384389 0.432029 -0.620208 -0.390714 -0.395516 -0.377161 -0.383575 -0.260810 -0.268509 -0.260693 -0.250389 -0.246835 -0.247280 0.233346 0.204607 0.203529 0.220475 0.207052 0.207144 0.205849 0.204056 0.222006 0.221687 0.187148 0.234109 0.227803 0.228226 0.252136 0.224409 0.222476 0.224753 0.223025 0.227532 0.226862
chargesum: 0.00000
title: Mulliken charges with hydrogens summed into heavy atoms:
elementType: N C C C C C C C C C C C C C C C C C C
charge: -0.047352 0.113317 -0.067593 -0.063787 0.014919 0.013596 0.384389 0.432029 0.010632 -0.156606 -0.167712 -0.148935 -0.131439 -0.036402 -0.046033 -0.035940 -0.027365 -0.019303 -0.020418
polarizability: 2.07927013e+02 -1.10842675e+01 2.13965553e+02 3.24419260e+00 -2.26450674e+00 1.48804278e+02
1716.lowfreq: -0.0005 -0.0002 0.0006 2.6977 9.2490 11.8126 21.9800 48.5825 61.8757
frequency: 21.7356 48.5609 61.8751 77.1989 96.6056 160.0895 181.6361 226.0002 231.7338 249.9363 261.5058 286.5147 299.4670 332.0512 351.8361 391.0864 402.6461 404.6064 427.1777 475.4631 497.2172 539.0567 544.1145 555.8890 618.0028 618.2828 647.7614 685.5268 704.4230 706.1047 738.7490 765.1376 766.5047 811.5740 850.0063 855.3863 860.7335 897.7367 908.1227 934.2435 935.7851 975.3596 978.8393 989.3497 991.8776 993.6384 993.9800 998.2078 1020.9195 1027.8072 1031.2453 1046.9515 1060.0814 1078.0586 1083.9722 1091.9708 1120.3982 1125.2885 1138.4622 1165.2396 1172.9081 1173.1738 1187.4592 1194.2431 1195.9913 1202.1049 1204.3529 1281.5035 1285.9668 1292.8198 1316.8554 1323.7240 1330.0574 1348.0420 1353.5391 1372.1694 1373.6798 1379.6380 1430.6867 1431.9162 1432.9797 1460.7211 1465.1290 1466.9403 1474.7557 1481.9156 1482.2522 1485.9478 1492.0629 1586.5014 1587.6371 1608.3152 1611.6880 2846.1769 2850.9400 2865.4389 3003.2002 3008.3025 3014.9297 3018.5860 3025.6613 3062.5319 3071.8998 3073.6032 3116.7653 3121.1849 3124.7056 3129.1926 3138.1362 3145.7296 3153.3221 3153.5467 3164.6444 3165.5986
redmass: 3.6479 3.7286 4.0608 4.2247 3.7621 2.1107 3.3962 1.4037 3.4217 3.1464 4.8915 2.9770 4.6339 2.3131 2.0094 2.0872 2.7749 2.7651 2.6930 3.9688 3.4413 3.0118 2.3026 3.7441 6.3539 6.3408 4.0690 5.0687 1.6601 1.6693 3.0877 2.0475 2.0231 1.5293 1.2487 1.2589 2.7842 2.2378 1.6350 1.8233 1.7906 1.3878 1.3977 5.7430 5.5057 1.3255 1.3511 2.3856 1.6145 2.6219 2.3773 2.0802 1.7483 1.8500 1.8272 1.5913 1.6602 2.9293 2.6087 2.5959 1.0637 1.0627 1.0664 1.9088 1.7954 1.1329 1.5181 1.9029 1.4714 1.6582 1.3568 1.3890 1.3329 1.3855 1.3195 6.2173 2.5148 1.9777 1.2118 2.2077 2.1842 1.0507 1.0888 1.1066 1.3795 1.4800 1.2087 1.2035 1.4978 5.8025 5.8175 6.0035 6.0458 1.0624 1.0687 1.0661 1.0711 1.0747 1.0722 1.0754 1.0746 1.1014 1.1011 1.1010 1.0846 1.0843 1.0873 1.0878 1.0933 1.0920 1.0943 1.0953 1.0995 1.0999
irintensity: 0.0300 0.0462 0.1329 0.5532 0.5192 0.1822 2.1194 0.4010 0.7733 0.1221 0.0830 0.1599 1.1305 7.1708 1.1840 1.1829 0.0052 0.0392 0.3886 1.2098 0.4291 12.4260 3.0226 9.6105 0.1482 0.0730 7.7364 2.0203 55.9412 48.4836 3.8210 39.9644 34.3782 0.0914 0.0787 0.0085 1.3890 2.0412 0.0678 4.1820 2.8149 0.0386 0.0564 0.8464 0.7078 0.9799 1.9328 27.8137 5.9538 13.0219 9.2293 10.0437 11.7034 6.6769 0.6036 10.2144 1.6118 5.6658 19.1489 3.1931 0.0209 0.0710 4.4725 1.2631 1.3791 0.1636 7.8247 15.4523 5.8290 4.5660 1.2785 1.0430 0.0584 5.7716 2.0234 0.7025 4.9192 10.7049 3.7098 6.8904 8.3039 28.6542 8.4131 6.4476 15.0802 43.9145 19.4102 3.9205 5.1156 1.2407 1.0262 16.2023 4.7535 54.9855 45.5396 194.4293 9.1626 28.4100 49.2604 81.7708 43.2721 21.6125 39.3019 35.0724 6.8085 1.9539 1.7883 4.4770 34.7030 32.0826 41.3794 28.6482 18.2360 13.4129
temp: 298.150 k
press: 1.00000 atm
elementType: 7 6 6 6 6 6 6 6 6 6 6 6 6 6 6 6 6 6 6 1 1 1 1 1 1 1 1 1 1 1 1 1 1 1 1 1 1 1 1 1
symmnumber: 1
zpe: 897686.7 jmol-1
zpe.correction: 0.341911 hartree
zpe.thermalcorrener: 0.358294 hartree
zpe.thermalcorrenthalpy: 0.359238 hartree
zpe.thermalcorrgfe: 0.297622 hartree
zpe.sumelectzpe: -751.864022 hartree
zpe.sumelectthermal: -751.847640 hartree
zpe.sumelectthermalent: -751.846695 hartree
zpe.sumelectthermalfe: -751.908312 hartree
dipole: -0.6904 0.5639 -0.0375
dipole: 0.8922
quadrupole: -110.0547 -108.4939 -110.5561
quadrupole: -1.1930 0.8515 -0.4081
quadrupole: -0.3531 1.2077 -0.8545 -1.1930 0.8515 -0.4081
hfenergy: -752.2059332 hartree
pointgroup: C01 [X(C18H21N1)]
dipole: -0.2823277 -0.2031916 0.0470392 debye
polarizability: 208.9451254|10.6134715|211.0767262|-5.843846|-10.6453151|150.6749915 unknown
InChI: InChI=1S/C18H21N/c1-19-14-12-18(13-15-19,16-8-4-2-5-9-16)17-10-6-3-7-11-17/h2-11H,12-15H2,1H3
charge 0 multiplicity 1
40 atoms
N  -2.501181 2.213356 -0.251181
C  -0.050795 0.474057 -0.060864
C  -0.536832 1.444469 1.071993
C  -0.610312 1.077327 -1.397064
C  -2.061382 1.676395 1.059952
C  -2.135241 1.292224 -1.35529
C  -0.569877 -0.973835 0.144462
C  1.506623 0.487598 -0.081586
C  -3.936632 2.551401 -0.258585
C  -0.935409 -1.474057 1.421668
C  2.202278 1.695252 -0.370565
C  -0.619689 -1.883941 -0.946456
C  2.284433 -0.660722 0.22002
C  -1.348934 -2.813864 1.601871
C  3.611961 1.75158 -0.367343
C  -1.032308 -3.223387 -0.776252
C  3.697712 -0.608261 0.225761
C  -1.404313 -3.69822 0.50222
C  4.371472 0.596531 -0.069131
H  -0.044593 2.421329 0.917758
H  -0.211555 1.085103 2.065379
H  -0.342588 0.44403 -2.261314
H  -0.139335 2.061325 -1.567023
H  -2.599818 0.726722 1.309963
H  -2.323074 2.415097 1.841968
H  -2.465977 1.747701 -2.308377
H  -2.659613 0.306438 -1.260327
H  -4.2073 3.007458 -1.228101
H  -4.149924 3.287629 0.537579
H  -4.602838 1.665253 -0.09609
H  -0.894922 -0.820795 2.298656
H  1.643719 2.610436 -0.599308
H  -0.319526 -1.553538 -1.946265
H  1.787316 -1.607364 0.45173
H  -1.6257 -3.164343 2.602906
H  4.117291 2.697093 -0.595939
H  -1.058055 -3.896399 -1.641061
H  4.269802 -1.513031 0.462105
H  -1.726496 -4.736615 0.638232
H  5.466512 0.63727 -0.065903
