program: Gaussian 09
title: 000210346
version: EM64L-G09RevD.01
frameworkgroup: C1[X(C14H29NO4S2)]
method: RPBEPBE
basis: SDD
operation: Freq
keyword: #p
keyword: freq=noraman
keyword: PBEPBE/SDD
title: #p freq=noraman PBEPBE/SDD
converged: YES YES NO NO
title: Mulliken charges:
elementType: S S O O O O N C C C C C C C C C C C C C C H H H H H H H H H H H H H H H H H H H H H H H H H H H H H
charge: 0.086694 0.973701 -0.301556 -0.562290 -0.507367 -0.513027 -0.311377 0.082981 -0.459128 -0.466394 -0.387180 -0.379400 -0.404017 -0.354448 -0.257735 -0.405364 -0.346686 -0.395503 -0.350536 -0.321138 -0.717974 0.168089 0.202734 0.195763 0.201276 0.206092 0.190661 0.209725 0.201298 0.193910 0.189096 0.211909 0.189449 0.185031 0.188005 0.182543 0.205071 0.189222 0.221441 0.186556 0.185683 0.212988 0.229455 0.214189 0.290046 0.230900 0.228873 0.288788 0.322564 0.376384
chargesum: 0.00000
title: Mulliken charges with hydrogens summed into heavy atoms:
elementType: S S O O O O N C C C C C C C C C C C C C C
charge: 0.086694 0.973701 -0.301556 -0.185906 -0.507367 -0.513027 -0.021331 0.251069 -0.060630 -0.059026 0.013205 0.015808 -0.003011 0.020032 0.112813 -0.011070 0.061311 0.003169 0.093108 0.138636 -0.106622
polarizability: 3.28750328e+02 6.94248940e+01 2.80147920e+02 -1.49978200e+01 -2.18888717e+01 1.92394269e+02
1716.lowfreq: -21.1697 -5.8851 -0.0017 0.0011 0.0011 4.0224 6.8315 10.4319 17.8045
frequency: -19.7525 9.5639 17.6185 19.8912 26.8847 35.1941 51.9131 64.3346 88.1591 100.4986 104.3790 115.2785 118.5680 122.1155 148.4506 151.0250 166.7933 169.1514 200.4128 209.8102 224.4985 228.1184 242.1348 251.2955 274.1524 280.3205 289.2200 304.4651 310.6363 342.9548 376.8500 398.2449 400.1618 407.3200 431.1424 478.8710 520.5827 524.6318 547.1955 659.3575 704.0751 719.8302 725.1977 735.1915 762.4926 771.5503 801.4220 818.5499 826.5610 853.7347 855.0600 885.8728 910.7739 916.6543 935.1772 943.5581 944.9918 973.7309 990.0374 1013.2596 1015.9932 1025.3771 1032.5551 1037.2168 1060.2954 1068.3425 1071.5567 1081.9346 1099.7237 1124.9243 1141.5624 1158.5876 1164.8096 1171.7326 1176.4850 1195.9172 1200.0840 1206.1546 1213.7025 1243.1145 1246.2950 1255.5866 1259.7333 1273.3497 1282.8141 1286.6034 1292.5470 1297.7940 1315.3739 1324.9651 1325.4249 1334.6844 1345.1755 1346.2707 1350.0159 1362.6131 1366.2913 1367.4656 1369.2791 1373.1180 1384.4151 1416.3013 1444.4114 1451.1009 1453.3142 1458.0101 1463.5784 1465.3055 1466.9019 1468.5435 1474.7652 1478.0809 1479.0178 1480.4177 1488.8849 2884.8964 2889.3782 2913.1907 2921.6920 2948.8685 2953.5561 2958.1563 2959.7845 2962.9959 2967.3100 2969.0773 2969.5292 2975.5530 2981.2044 2986.6684 2989.5159 3009.2749 3015.8128 3017.0147 3018.5760 3028.0537 3030.4189 3032.0199 3052.1667 3054.3719 3055.8116 3070.5792 3454.9419 3541.4768
redmass: 3.5089 6.0756 6.7860 5.5878 6.9504 4.5707 3.5125 3.1056 2.3385 3.0794 3.6611 2.3088 2.4183 6.7697 2.6647 2.3146 1.7960 2.8744 3.5847 2.7870 2.4813 3.3708 3.6059 3.5033 3.6877 3.2717 2.9387 5.1873 1.6128 2.8749 2.6533 4.0196 5.4523 2.5306 2.2710 2.6509 2.6434 10.0662 2.6787 2.3046 3.4000 2.5116 1.3759 1.1469 1.3444 1.4247 1.9419 16.0937 2.7686 1.7950 1.7433 1.9473 1.8932 8.0714 2.2043 2.1373 2.2697 2.1211 3.4323 1.9399 2.6690 2.0692 1.6976 2.2681 1.2279 2.4916 1.8707 2.6465 2.2373 1.7459 2.0279 1.3058 1.3443 2.1673 3.0263 1.2903 1.2147 1.1725 1.2324 1.4361 1.2691 1.1955 1.2019 1.2177 1.1053 1.1150 1.1165 1.1278 1.2737 1.4428 1.3239 1.3672 1.2534 1.3426 1.4386 1.4067 1.4507 1.3586 1.5765 1.4187 1.3798 1.0614 1.3400 1.0856 1.0813 1.0832 1.0871 1.0757 1.0796 1.0806 1.0844 1.0830 1.0870 1.0873 1.0892 1.0695 1.0821 1.0549 1.0665 1.0675 1.0640 1.0671 1.0850 1.0653 1.0617 1.0655 1.0640 1.0630 1.0686 1.0847 1.0649 1.0989 1.0952 1.0989 1.0968 1.1016 1.1004 1.1001 1.1007 1.0921 1.1022 1.0980 1.0660 1.0776
irintensity: 0.2051 0.4226 0.4264 0.3800 0.4922 2.0576 1.8412 0.5578 1.1447 4.4247 11.8722 17.1417 1.9168 26.4280 0.7319 10.2271 54.5410 8.4697 5.4828 47.2896 17.5309 9.9792 5.8283 5.4207 21.3633 3.0604 12.5169 28.3895 118.3376 28.6677 2.0558 36.5947 21.6442 21.3002 8.0453 7.4531 19.5107 146.1197 2.2751 1.2140 2.0516 2.3787 4.0011 7.6910 20.6724 4.4104 4.0735 72.4703 4.2569 15.7678 1.7050 2.0804 24.3281 75.3057 2.4293 2.6690 1.2763 55.9748 14.2017 8.6046 9.2746 7.3939 11.8665 52.4499 49.3261 8.9748 11.4437 50.8350 3.8222 12.6484 5.0844 21.9382 9.0929 3.1428 16.0918 5.6204 0.8035 3.1322 3.9578 1.2437 11.0059 5.8639 27.5390 9.1660 3.2528 0.5922 1.6314 0.8784 31.5092 10.9083 10.0909 0.1718 4.6289 9.0396 1.4730 25.4497 15.5167 0.4150 25.2315 0.3966 0.5824 14.9113 34.1816 3.8086 1.7714 8.9530 8.3950 10.9769 13.7290 13.3341 11.0243 8.9209 15.6022 3.0260 11.4062 49.8270 63.4858 64.6641 3.7945 42.4796 19.1996 46.4606 25.1694 15.9841 3.7938 31.0280 13.9097 90.6833 87.6114 36.3675 61.5188 57.1182 22.9762 20.3906 60.5531 60.4222 4.8916 40.7619 119.8645 4.8943 97.8260 14.3352 69.8511 89.8913
temp: 298.150 k
press: 1.00000 atm
elementType: 16 16 8 8 8 8 7 6 6 6 6 6 6 6 6 6 6 6 6 6 6 1 1 1 1 1 1 1 1 1 1 1 1 1 1 1 1 1 1 1 1 1 1 1 1 1 1 1 1 1
symmnumber: 1
zpe: 1105650.5 jmol-1
zpe.correction: 0.421120 hartree
zpe.thermalcorrener: 0.447186 hartree
zpe.thermalcorrenthalpy: 0.448130 hartree
zpe.thermalcorrgfe: 0.360040 hartree
zpe.sumelectzpe: -1700.718022 hartree
zpe.sumelectthermal: -1700.691956 hartree
zpe.sumelectthermalent: -1700.691012 hartree
zpe.sumelectthermalfe: -1700.779102 hartree
dipole: -4.7322 -3.3040 1.1993
dipole: 5.8948
quadrupole: -166.5410 -132.1328 -147.2713
quadrupole: -10.1109 14.9451 1.9221
quadrupole: -17.8927 16.5156 1.3770 -10.1109 14.9451 1.9221
hfenergy: -1701.1391423 hartree
pointgroup: C01 [X(C14H29N1O4S2)]
dipole: 1.7952367 -0.7347026 -1.2711821 debye
polarizability: 321.8161495|-44.5183682|223.6665591|-57.6128465|49.9482941|255.8098092 unknown
InChI: InChI=1S/C14H28NOS.HO3S/c17-13-11-15-10-6-3-7-12-16-14-8-4-1-2-5-9-14;1-4(2)3/h14-15H,1-13H2;1H
charge 0 multiplicity 1
50 atoms
S  -6.078882 0.03595 -0.416999
S  -5.437429 1.123729 1.762477
O  3.989595 -0.871351 -0.141958
O  -5.359808 2.882605 1.148357
O  -6.499207 1.110463 2.987085
O  -3.913457 0.628209 2.057856
N  -2.402795 -1.084379 -1.960804
C  5.315994 -0.479779 0.379148
C  5.903149 0.554846 -0.606365
C  5.284161 0.000846 1.854048
C  4.940067 1.651958 -1.134312
C  4.320226 1.161874 2.187924
C  3.962887 2.293072 -0.111685
C  4.488615 2.447482 1.338475
C  3.419855 -2.064689 0.495224
C  2.177884 -2.470106 -0.30849
C  1.068864 -1.394963 -0.29222
C  -0.1588 -1.794148 -1.139189
C  -1.272755 -0.730393 -1.094028
C  -3.651842 -0.342873 -1.860048
C  -4.455275 -0.843398 -0.618058
H  5.971174 -1.384406 0.355091
H  6.308674 0.014952 -1.48414
H  6.770591 1.026192 -0.103301
H  6.322109 0.296517 2.112773
H  5.042368 -0.859573 2.511134
H  5.571045 2.443818 -1.587237
H  4.33693 1.224283 -1.956653
H  3.274371 0.811408 2.072463
H  4.451176 1.410223 3.260839
H  3.66231 3.286301 -0.501814
H  3.042781 1.678846 -0.069388
H  3.920484 3.259462 1.83501
H  5.550931 2.769892 1.33713
H  4.172766 -2.885412 0.495085
H  3.143326 -1.850008 1.551369
H  2.487036 -2.672091 -1.353007
H  1.785097 -3.421017 0.10655
H  1.493527 -0.443438 -0.665038
H  0.750797 -1.21308 0.755736
H  0.162132 -1.947624 -2.192122
H  -0.570233 -2.760708 -0.78713
H  -1.643643 -0.62412 -0.053934
H  -0.848675 0.265772 -1.369863
H  -2.168785 -1.497108 -2.865637
H  -3.498339 0.752582 -1.750049
H  -4.243132 -0.506744 -2.777872
H  -4.635121 -1.932146 -0.651655
H  -3.863285 -0.619447 0.297047
H  -5.526854 3.47002 1.944975
