program: Gaussian 09
title: 000207963
version: EM64L-G09RevD.01
frameworkgroup: C1[X(C13H15ClN2S)]
method: RPBEPBE
basis: SDD
operation: Freq
keyword: #p
keyword: freq=noraman
keyword: PBEPBE/SDD
title: #p freq=noraman PBEPBE/SDD
converged: YES YES NO NO
title: Mulliken charges:
elementType: Cl S N N C C C C C C C C C C C C C H H H H H H H H H H H H H H H
charge: -0.081586 0.189166 -0.331061 -0.080564 -0.226631 -0.454825 0.298506 -0.515462 -0.154501 0.464208 -0.564237 -0.763410 -0.373619 -0.442826 -0.224219 -0.217164 -0.239903 0.235973 0.246547 0.273375 0.225703 0.314184 0.270761 0.272002 0.243315 0.218450 0.244318 0.252147 0.233461 0.228580 0.228305 0.231005
chargesum: 0.00000
title: Mulliken charges with hydrogens summed into heavy atoms:
elementType: Cl S N N C C C C C C C C C C C C C
charge: -0.081586 0.189166 -0.016877 -0.080564 -0.226631 0.027695 0.298506 -0.016384 -0.154501 0.464208 -0.021474 -0.057327 -0.121473 -0.209365 0.004361 0.011142 -0.008898
polarizability: 2.91536827e+02 -2.56751167e+00 1.37628715e+02 -1.63047743e+01 -7.51622357e+00 1.32457544e+02
1716.lowfreq: -13.2996 -8.6916 -3.6876 -2.6152 -0.0007 -0.0005 0.0019 19.8758 22.6874
frequency: -9.0989 19.8470 22.6535 39.2949 52.9592 68.6907 118.5532 134.1893 143.7513 177.2400 198.0021 206.9856 246.7259 266.8353 296.0669 352.4295 378.0570 403.6184 419.5176 452.6993 489.5609 505.8775 551.5897 567.1292 592.8006 613.8085 616.3199 643.1033 690.7303 705.9077 711.8276 753.1385 771.2493 815.2461 857.8235 888.4020 916.6662 970.4102 980.4723 983.3647 990.3354 998.8401 1018.6690 1026.3436 1033.4091 1042.8412 1050.0200 1086.8608 1141.1065 1156.3706 1172.8746 1186.5486 1196.3342 1213.6488 1226.2653 1246.2552 1272.5498 1312.3082 1313.0965 1319.5779 1349.1803 1386.6783 1398.9580 1441.5074 1451.5709 1458.3051 1460.7082 1474.9402 1476.2423 1478.5441 1488.6749 1570.7051 1592.3352 1599.1245 1615.1046 2971.3758 2988.7434 3007.9318 3047.1712 3059.3800 3065.5422 3068.5891 3104.7024 3117.7890 3125.4345 3137.0728 3146.6900 3148.3645 3164.6567 3580.7525
redmass: 5.3926 6.7067 4.1957 3.9187 6.9972 3.0780 1.0635 3.9171 4.9675 5.0359 5.4364 4.0872 4.4194 3.2893 3.0213 3.4000 4.3057 2.7936 2.8099 1.4855 4.4793 6.8675 5.4534 4.8966 4.8189 6.4184 6.3792 6.6223 3.9262 1.9503 5.3307 1.6685 1.2754 3.6509 1.2461 2.5697 1.3867 1.7367 1.4477 2.4230 6.0061 1.3476 1.7122 2.1790 2.9926 1.7609 3.0474 1.5737 1.3840 2.7535 1.0554 1.1366 2.8956 2.2842 1.2730 1.2116 1.1569 2.0129 1.6119 1.9645 1.3920 5.8252 1.2711 2.1457 1.0819 1.0609 1.0932 1.3774 1.1441 1.4119 1.5436 6.6180 7.0613 7.2497 6.0235 1.0661 1.0370 1.0606 1.0950 1.0571 1.1006 1.0980 1.0985 1.0871 1.0863 1.0913 1.1123 1.0962 1.1016 1.0777
irintensity: 0.0830 0.0425 0.0589 0.5558 0.1668 2.3796 0.0482 1.2471 3.0926 1.1646 5.0722 3.4423 5.0296 4.9067 1.9661 3.2402 35.1292 2.5759 11.1511 101.0216 29.6729 4.6231 9.0632 11.3637 42.4544 5.7015 0.3219 25.4113 43.0126 44.7144 10.9518 57.2101 0.2537 6.0218 0.1339 14.7428 3.1291 3.8308 1.0975 3.4911 0.5436 0.5549 0.3880 15.0122 6.2992 4.3059 17.5734 12.0294 15.2818 58.2366 0.1104 7.2822 46.1158 3.2520 83.8322 7.3333 1.9917 42.7536 24.0251 10.1324 12.8824 11.9262 26.7000 22.8124 3.1364 16.7773 1.9130 43.9168 15.6644 78.2529 1.8456 168.1536 223.5730 343.7129 4.2297 55.2398 26.3510 15.5567 8.8345 14.9642 6.7653 15.2876 23.6665 7.9817 0.9678 13.8012 12.0504 39.9001 23.7738 68.4030
temp: 298.150 k
press: 1.00000 atm
elementType: 17 16 7 7 6 6 6 6 6 6 6 6 6 6 6 6 6 1 1 1 1 1 1 1 1 1 1 1 1 1 1 1
symmnumber: 1
zpe: 661562.3 jmol-1
zpe.correction: 0.251976 hartree
zpe.thermalcorrener: 0.268582 hartree
zpe.thermalcorrenthalpy: 0.269526 hartree
zpe.thermalcorrgfe: 0.204517 hartree
zpe.sumelectzpe: -1470.761034 hartree
zpe.sumelectthermal: -1470.744428 hartree
zpe.sumelectthermalent: -1470.743484 hartree
zpe.sumelectthermalfe: -1470.808493 hartree
dipole: 3.8936 -0.0678 -0.6918
dipole: 3.9552
quadrupole: -124.2462 -115.4162 -109.6923
quadrupole: -8.9538 -2.4383 -0.3718
quadrupole: -7.7946 1.0354 6.7592 -8.9538 -2.4383 -0.3718
hfenergy: -1471.0130099 hartree
pointgroup: C01 [X(C13H15Cl1N2S1)]
dipole: -1.5259843 0.0418251 -0.3017344 debye
polarizability: 290.8169863|-2.1587929|134.4990613|19.3501098|8.2446514|136.3070393 unknown
InChI: InChI=1S/C13H15ClN2S/c1-10-12(7-8-14)17-13(16-10)15-9-11-5-3-2-4-6-11/h2-6,15H,7-9H2,1H3
charge 0 multiplicity 1
32 atoms
Cl 7.084854 1.014016 0.226664
S  1.877439 1.4463 0.166175
N  -0.660944 0.653371 -0.722115
N  1.012399 -1.034291 -0.390597
C  3.009083 0.010595 0.370181
C  4.430372 0.242808 0.813487
C  2.35367 -1.163336 0.024363
C  -1.707295 -0.27604 -1.189764
C  0.598995 0.224807 -0.381368
C  -3.054413 -0.008981 -0.527648
C  5.302275 0.727288 -0.359732
C  2.940119 -2.552174 0.053914
C  -3.152604 0.127171 0.881383
C  -4.232035 0.079737 -1.309404
C  -4.405716 0.343016 1.494459
C  -5.489103 0.292044 -0.697256
C  -5.579167 0.424913 0.706827
H  4.850933 -0.697287 1.212805
H  4.481008 0.984082 1.632041
H  -1.339283 -1.291026 -0.953888
H  -1.811156 -0.216315 -2.292279
H  -0.876056 1.649322 -0.69496
H  4.966257 1.695192 -0.760456
H  5.372069 -0.020301 -1.163396
H  2.926861 -2.995962 -0.95829
H  3.978576 -2.557245 0.422165
H  2.333015 -3.207442 0.704233
H  -2.243573 0.061932 1.490954
H  -4.166651 -0.017799 -2.400466
H  -4.470052 0.443895 2.58377
H  -6.392494 0.358399 -1.313852
H  -6.551583 0.592509 1.183149
