program: Gaussian 09
title: 000207952
version: EM64L-G09RevD.01
frameworkgroup: C1[X(C6H11F3O2)]
method: RPBEPBE
basis: SDD
operation: Freq
keyword: #p
keyword: freq=noraman
keyword: PBEPBE/SDD
title: #p freq=noraman PBEPBE/SDD
converged: YES YES NO NO
title: Mulliken charges:
elementType: F F F O O C C C C C C H H H H H H H H H H H
charge: -0.159264 -0.155730 -0.152468 -0.263960 -0.245467 -0.075017 0.387517 -0.248701 -0.236843 -0.657479 -0.679857 0.245432 0.195518 0.232052 0.230124 0.225824 0.214980 0.224331 0.249341 0.211684 0.232981 0.225002
chargesum: 0.00000
title: Mulliken charges with hydrogens summed into heavy atoms:
elementType: F F F O O C C C C C C
charge: -0.159264 -0.155730 -0.152468 -0.263960 -0.245467 0.170416 0.387517 0.178869 0.219105 0.031172 -0.010190
polarizability: 7.74258259e+01 -4.80776351e-01 8.40006981e+01 -1.80602713e+00 1.01127933e+00 6.31912528e+01
1716.lowfreq: -2.9567 -0.0008 -0.0005 0.0003 3.0959 9.4156 38.4744 44.1467 68.1606
frequency: 38.4127 44.0275 67.9764 88.5393 100.4312 162.5154 183.1832 235.7458 241.6490 244.7206 289.0082 303.4117 333.9057 387.5565 435.0280 461.3366 500.9691 585.6179 660.5208 778.5517 793.7801 802.0933 815.2613 851.3914 960.0782 993.8131 1013.7136 1033.6820 1046.9799 1058.7599 1091.1263 1113.3940 1139.1159 1158.0027 1189.5124 1262.5495 1268.7381 1323.0123 1341.9453 1360.0498 1370.1246 1391.6634 1398.4124 1460.4883 1461.9479 1468.5521 1478.3581 1488.4713 1490.4143 2970.0755 2988.8149 2991.3259 2994.3554 3007.6913 3057.6881 3076.2301 3083.2846 3091.4487 3102.8681 3109.3612
redmass: 4.3326 3.7240 2.7950 2.4183 3.8978 2.9492 4.0857 1.4988 3.5712 1.2791 4.2431 4.5724 3.4120 5.1554 3.9300 13.4568 11.4878 6.4957 9.0288 3.4516 3.0126 1.2673 1.1118 3.5696 3.8621 3.8208 2.6643 9.7998 7.3888 6.1016 2.0568 2.1312 1.5251 1.7949 4.7576 1.1401 1.1390 1.2808 1.2401 1.2345 1.2599 1.2250 1.2656 1.0420 1.0420 1.0730 1.0583 1.0768 1.0594 1.0665 1.0372 1.0504 1.0430 1.0846 1.1063 1.0977 1.0978 1.0988 1.1021 1.1017
irintensity: 0.2887 0.4378 0.1632 1.2951 2.3640 3.0353 7.4970 1.7110 0.6471 1.1276 4.2032 0.5396 4.7791 5.3992 2.9425 3.0818 2.4594 30.5143 0.5813 0.5540 22.6852 10.0289 4.0566 37.6840 76.3466 90.8901 130.1141 294.7233 207.3739 187.7217 37.1206 1.2771 6.9813 7.9200 88.0401 0.8010 4.1355 3.7419 9.0586 3.4430 2.3518 19.9039 29.8776 16.2359 5.0773 5.2630 0.5005 12.9214 16.9199 56.3278 16.5319 30.4597 20.4694 23.8735 10.2757 7.0724 44.0534 29.5931 42.3119 36.4499
temp: 298.150 k
press: 1.00000 atm
elementType: 9 9 9 8 8 6 6 6 6 6 6 1 1 1 1 1 1 1 1 1 1 1
symmnumber: 1
zpe: 444063.9 jmol-1
zpe.correction: 0.169135 hartree
zpe.thermalcorrener: 0.182083 hartree
zpe.thermalcorrenthalpy: 0.183027 hartree
zpe.thermalcorrgfe: 0.128735 hartree
zpe.sumelectzpe: -684.279803 hartree
zpe.sumelectthermal: -684.266855 hartree
zpe.sumelectthermalent: -684.265911 hartree
zpe.sumelectthermalfe: -684.320203 hartree
dipole: -3.5527 -0.7333 -0.3725
dipole: 3.6467
quadrupole: -67.0170 -58.7681 -66.6487
quadrupole: 2.3697 -1.6357 4.3578
quadrupole: -2.8724 5.3765 -2.5041 2.3697 -1.6357 4.3578
hfenergy: -684.4489381 hartree
pointgroup: C01 [X(C6H11F3O2)]
dipole: -0.1062615 -1.385306 0.3578087 debye
dipolederiv: -0.5493612 -0.200528 -0.1712117 -0.2572848 -0.6105003 -0.1494085 -0.1483088 -0.0852979 -0.3909142 -0.7274909 0.2372352 0.0567717 0.3262514 -0.5707782 -0.0086956 0.0287788 0.0198317 -0.2904768 -0.306141 0.0355637 0.1121059 0.021021 -0.4046877 0.0654468 0.1204344 -0.0378171 -0.7607539 -0.9522429 -0.3360856 0.0586081 -0.4238336 -0.9573944 0.0399297 -0.197563 0.0230343 -0.3573214 -1.1762251 0.0904713 0.1456989 0.2705555 -0.5997665 -0.0721452 0.2155916 -0.1215208 -0.4293127 1.3070442 0.0675572 0.0046975 0.0117656 0.7576855 0.0839522 0.4038455 0.2222763 0.2732027 1.4183121 -0.036345 0.0064586 -0.0542348 1.4535017 0.0972583 -0.0471704 0.1458412 1.378835 0.5332932 0.180305 -0.0895554 0.2669722 0.716057 -0.0890498 -0.1951065 -0.1773032 0.349474 0.6127759 -0.0404396 -0.1752595 -0.0911984 0.3956075 0.0742114 -0.3911961 0.1007939 0.3615125 -0.0457382 0.0737245 -0.0395233 0.0345821 -0.1784074 0.0616999 0.0111667 0.0838741 0.0094575 -0.0597579 0.092663 -0.0038305 0.1198656 -0.0220168 0.0103646 0.0058504 0.0201467 0.0571104 -0.0454691 0.0322405 0.0790272 0.0202501 0.0221279 0.0029272 0.0373585 -0.08339 -0.0692422 0.0052154 0.0074259 0.0562661 0.0383023 -0.0668398 -0.0927794 0.1638659 -0.0335691 -0.1059085 -0.069517 -0.0467543 -0.0799132 -0.0599558 0.0162997 0.0051167 -0.1195977 0.0011374 0.0013251 -0.0230104 -0.0147477 -0.100081 -0.0076319 0.0389958 -0.0562473 -0.0128685 -0.0592131 -0.0537719 -0.0172797 -0.0437997 0.058687 -0.0696572 -0.1197657 0.0809437 0.091029 0.0215498 0.0151766 -0.0079311 -0.1128912 0.0728285 -0.1148185 -0.0627981 0.0790136 0.0707224 0.0860008 0.0736348 0.0549746 0.0806704 0.067809 0.0571211 0.0647789 -0.0449861 0.0849069 -0.0805983 -0.0772508 -0.0069553 0.0204273 -0.1068063 -0.014473 0.0828338 -0.0529694 -0.1207711 -0.0491257 0.0222524 -0.0192374 0.0510013 0.1057486 0.0512165 0.0856281 -0.0244519 0.1347261 -0.0397118 -0.0517347 0.025573 -0.0272418 -0.0890327 -0.0518755 0.0547504 -0.0722024 -0.136156 -0.0367694 -0.0282029 0.0491688 -0.1104521 0.0305064 -0.07294 -0.0953114 0.0620714 0.0004617 0.0798302 0.0729089 unknown
polarizability: 83.6208556|0.0146432|77.5867927|-3.1430694|-0.3747457|63.4101284 unknown
InChI: InChI=1S/C6H11F3O2/c1-3-10-5(11-4-2)6(7,8)9/h5H,3-4H2,1-2H3
charge 0 multiplicity 1
22 atoms
F  0.748982 2.579991 0.419421
F  -1.455548 2.445287 -0.085773
F  0.097569 1.73158 -1.579485
O  -1.176999 -0.399094 -0.38491
O  0.996861 -0.226149 0.692273
C  -0.295223 0.364517 0.461134
C  -0.223363 1.767436 -0.208134
C  -1.960564 -1.451063 0.313528
C  1.816557 -0.520712 -0.522803
C  -1.140063 -2.707279 0.632301
C  2.864454 -1.547774 -0.103449
H  -0.711381 0.506207 1.478889
H  -2.403455 -1.01617 1.234153
H  -2.77538 -1.675338 -0.394494
H  1.153096 -0.904181 -1.319692
H  2.288151 0.419613 -0.866677
H  -1.799551 -3.478125 1.074053
H  -0.69456 -3.122907 -0.288439
H  -0.327511 -2.488321 1.345009
H  3.534864 -1.771591 -0.953367
H  3.476942 -1.162166 0.72972
H  2.385822 -2.487458 0.222344
