program: Gaussian 09
title: 000210349
version: EM64L-G09RevD.01
frameworkgroup: C1[X(C16H33NO4S2)]
method: RPBEPBE
basis: SDD
operation: Freq
keyword: #p
keyword: freq=noraman
keyword: PBEPBE/SDD
title: #p freq=noraman PBEPBE/SDD
converged: YES YES NO NO
title: Mulliken charges:
elementType: S S O O O O N C C C C C C C C C C C C C C C C H H H H H H H H H H H H H H H H H H H H H H H H H H H H H H H H H
charge: 0.095315 0.970564 -0.284570 -0.560404 -0.504486 -0.497196 -0.279600 0.063914 -0.451365 -0.429256 -0.396281 -0.396126 -0.385477 -0.262466 -0.402706 -0.377093 -0.380909 -0.380546 -0.370268 -0.398036 -0.368622 -0.266350 -0.761665 0.163846 0.205155 0.213503 0.202946 0.203069 0.202788 0.191256 0.190197 0.200584 0.191252 0.199095 0.173259 0.181880 0.207783 0.209476 0.188509 0.191117 0.196800 0.196038 0.194472 0.194829 0.194721 0.192946 0.189804 0.219199 0.201348 0.219107 0.273247 0.219786 0.230161 0.309952 0.297192 0.378308
chargesum: 0.00000
title: Mulliken charges with hydrogens summed into heavy atoms:
elementType: S S O O O O N C C C C C C C C C C C C C C C C
charge: 0.095315 0.970564 -0.284570 -0.182096 -0.504486 -0.497196 -0.006353 0.227760 -0.032706 -0.023240 -0.002237 -0.005345 0.004869 0.092673 0.014553 0.002533 0.011930 0.008756 0.017400 0.010968 0.051833 0.183597 -0.154521
polarizability: 4.98896427e+02 -2.70717616e+01 2.15301514e+02 -1.38961402e+01 4.89450394e+00 1.96134429e+02
1716.lowfreq: -6.6037 -3.0922 -0.0019 -0.0009 0.0019 0.9734 5.4198 9.8966 14.3598
frequency: -5.7097 7.9757 13.7108 20.8636 22.6404 32.5651 41.3850 47.5180 54.6250 76.6854 82.5648 87.0717 104.6244 108.8803 112.7222 124.1896 133.3097 140.5291 144.3757 146.6992 163.5771 182.7778 193.6832 205.9300 215.1365 222.1080 239.5957 263.5029 287.4354 299.1129 304.6906 318.9025 355.6938 381.4008 401.1668 414.6153 435.0310 452.3021 470.0667 486.5982 506.9350 522.2127 568.8799 598.4252 699.4706 723.3989 733.4135 745.0555 755.9942 784.1305 789.9588 799.6692 826.3191 840.1372 856.9846 877.6484 893.5144 907.6045 925.0820 930.3145 932.8892 972.3360 985.0153 998.2811 1001.7194 1010.1077 1030.6855 1040.1342 1042.2191 1048.7239 1052.9889 1055.1967 1064.2995 1070.8227 1078.7447 1081.9741 1085.6277 1108.7594 1112.2438 1121.3994 1145.6056 1153.1712 1156.9711 1180.8452 1193.0392 1206.4463 1212.9450 1237.9052 1242.0892 1247.4073 1251.0202 1254.7552 1262.6841 1272.0470 1279.3978 1281.5778 1289.9358 1290.3523 1293.9964 1296.2107 1303.1978 1307.7409 1321.3538 1329.6681 1333.4270 1338.6930 1341.3368 1345.8952 1355.0930 1357.3975 1360.6250 1379.7186 1390.4765 1421.9233 1453.7418 1460.7870 1461.9521 1462.5626 1464.3714 1465.4576 1466.2474 1468.8311 1473.8429 1474.5683 1479.8496 1481.9533 1485.0968 1490.1076 1491.4545 2874.1581 2892.0089 2908.2046 2916.5353 2950.5263 2952.2050 2953.1617 2955.1193 2959.9927 2960.5542 2966.4528 2966.9155 2967.1155 2969.7867 2978.1695 2986.4189 2988.7768 2989.2261 2994.0907 2997.2327 3009.9871 3024.7621 3029.3239 3029.9215 3030.7253 3037.2623 3044.0678 3045.7084 3053.5458 3055.9067 3057.6894 3453.7626 3462.4106
redmass: 6.5003 5.3172 5.6096 4.0961 4.9524 4.9396 2.9715 2.1860 3.8688 1.9785 3.5614 2.6956 3.6662 3.7378 2.4485 2.3628 2.4997 3.1793 3.9528 2.1613 2.4373 2.0787 3.4020 3.2845 2.3534 3.6441 4.2907 4.5539 7.9936 4.0651 6.0835 1.9517 3.8492 3.5699 13.1246 3.0869 3.2149 2.7783 2.7579 2.1790 3.1490 15.5901 2.6215 1.3029 4.3434 1.0630 1.0818 1.2494 1.1147 1.7505 1.7732 1.1818 15.4850 2.2469 1.2249 1.6368 1.8143 2.5508 1.8978 9.0367 1.2520 2.2618 4.0579 3.3508 1.6776 1.6310 3.4471 2.4616 2.1551 1.1352 3.7832 1.2624 3.2338 2.6101 1.4654 2.1137 2.2381 2.9793 2.5615 1.3026 1.6403 1.8595 3.3552 1.5414 1.5064 1.4231 1.2965 1.3026 1.3277 1.2710 1.2789 1.3012 1.2792 1.1859 1.1007 1.0639 1.1679 1.1979 1.0997 1.1221 1.2144 1.3094 1.3134 1.3527 1.4378 1.4774 1.3941 1.5125 1.5057 1.6942 1.4813 1.4271 1.4787 1.0762 1.2528 1.0738 1.0741 1.0864 1.0872 1.0892 1.0688 1.0819 1.0843 1.0895 1.0928 1.0951 1.0917 1.0851 1.0927 1.0701 1.0818 1.0575 1.0692 1.0590 1.0590 1.0637 1.0600 1.0931 1.0681 1.0607 1.0633 1.0637 1.0624 1.0615 1.0969 1.0608 1.0604 1.0987 1.0864 1.1025 1.0901 1.0974 1.1039 1.0954 1.1015 1.1031 1.1036 1.0978 1.1043 1.1025 1.0660 1.0751
irintensity: 0.1384 0.0780 0.4838 1.4847 0.3075 0.4437 1.4490 0.3396 0.1545 0.8904 2.1789 0.1770 5.1342 1.3338 17.1306 4.0118 0.9407 6.8641 4.7120 1.5429 14.1048 54.1732 9.1145 28.7827 10.6849 15.4251 10.1381 18.0222 17.4901 9.9414 17.3407 1.2295 1.5369 24.9442 42.9935 7.6676 0.6808 17.2449 22.1432 11.3791 33.3479 176.8935 17.5244 205.9564 1.3586 13.6258 0.0340 10.2790 3.9810 1.5832 1.3067 3.4008 95.0548 7.5477 3.6905 3.8949 5.7872 13.9133 2.0911 72.7970 11.5819 1.9009 15.7674 3.1087 1.2294 3.8358 39.7570 12.7166 17.6728 0.2648 106.9049 67.2017 3.6599 44.1983 3.9417 3.5435 3.7776 6.7726 4.3926 29.1959 0.5907 5.9257 10.2372 60.2682 7.6328 8.9865 44.5603 8.4069 2.7131 6.7976 3.0001 5.6458 2.9322 7.0250 6.2167 0.8868 3.1103 13.7423 4.5159 3.3547 0.4831 0.1110 5.2101 8.3707 29.9719 1.4755 0.8538 3.3216 4.6557 0.2376 25.7791 85.5047 0.7667 14.2982 36.6736 0.2930 0.1579 1.7149 3.9087 11.9488 1.3715 4.1696 16.9751 3.5594 4.9129 2.2009 6.0471 7.1743 26.5401 81.5723 42.2549 58.3110 34.0684 5.8621 0.4548 3.9419 1.1072 26.7163 11.4318 131.4262 37.3510 47.1639 35.0846 33.9842 0.6478 8.1541 61.3265 4.7003 29.0990 1.3370 21.8514 83.9861 5.7615 74.1055 6.5796 67.0527 100.1692 7.5996 95.0695 119.0328 72.8732 42.0292
temp: 298.150 k
press: 1.00000 atm
elementType: 16 16 8 8 8 8 7 6 6 6 6 6 6 6 6 6 6 6 6 6 6 6 6 1 1 1 1 1 1 1 1 1 1 1 1 1 1 1 1 1 1 1 1 1 1 1 1 1 1 1 1 1 1 1 1 1
symmnumber: 1
zpe: 1251013.2 jmol-1
zpe.correction: 0.476486 hartree
zpe.thermalcorrener: 0.505581 hartree
zpe.thermalcorrenthalpy: 0.506525 hartree
zpe.thermalcorrgfe: 0.409929 hartree
zpe.sumelectzpe: -1779.175427 hartree
zpe.sumelectthermal: -1779.146332 hartree
zpe.sumelectthermalent: -1779.145388 hartree
zpe.sumelectthermalfe: -1779.241984 hartree
dipole: 5.4866 -0.1188 -0.1842
dipole: 5.4910
quadrupole: -214.8328 -161.1758 -156.0847
quadrupole: 11.7647 -21.6322 4.6887
quadrupole: -37.4683 16.1886 21.2797 11.7647 -21.6322 4.6887
hfenergy: -1779.6519128 hartree
pointgroup: C01 [X(C16H33N1O4S2)]
dipole: -2.1584048 0.0004942 -0.0910163 debye
polarizability: 499.0099132|-17.5731441|208.6462367|24.2328793|-10.1756579|202.6762197 unknown
InChI: InChI=1S/C16H32NOS.HO3S/c19-15-13-17-12-8-3-1-2-4-9-14-18-16-10-6-5-7-11-16;1-4(2)3/h16-17H,1-15H2;1H
charge 0 multiplicity 1
56 atoms
S  8.876431 0.946472 -1.156886
S  9.969181 -0.532325 0.517245
O  -6.442754 0.500543 0.371366
O  9.859353 0.645869 1.958171
O  8.944249 -1.7625 0.799148
O  11.535588 -0.86411 0.285545
N  4.916514 0.053535 -0.393019
C  -7.738734 0.021659 -0.147502
C  -8.765937 1.11602 0.187484
C  -8.158759 -1.34127 0.450332
C  -10.184537 0.720408 -0.290144
C  -9.573676 -1.743471 -0.037329
C  -10.615142 -0.647552 0.292365
C  -5.284257 -0.278867 -0.083228
C  -4.022282 0.521207 0.259369
C  -2.724443 -0.222815 -0.129208
C  -1.448284 0.584845 0.197432
C  -0.146275 -0.149105 -0.194539
C  1.128651 0.663841 0.123553
C  2.427899 -0.063157 -0.289821
C  3.69173 0.7619 0.02104
C  6.196765 0.7587 -0.268715
C  7.250623 0.027044 -1.122131
H  -7.661378 -0.084744 -1.257562
H  -8.764543 1.266575 1.285314
H  -8.44422 2.068909 -0.271846
H  -7.429052 -2.128289 0.178689
H  -8.152347 -1.251426 1.555399
H  -10.908632 1.506595 -0.0026
H  -10.198966 0.664123 -1.398639
H  -9.551448 -1.90603 -1.135388
H  -9.868033 -2.707485 0.420379
H  -10.71518 -0.560104 1.393895
H  -11.609837 -0.935016 -0.100057
H  -5.352224 -0.452364 -1.182584
H  -5.257683 -1.271764 0.417514
H  -4.070808 1.499357 -0.256975
H  -4.026185 0.73464 1.346081
H  -2.739897 -0.455186 -1.214992
H  -2.684156 -1.199125 0.397875
H  -1.428955 0.81518 1.283032
H  -1.490454 1.562124 -0.326916
H  -0.101953 -1.124738 0.333167
H  -0.170024 -0.382708 -1.279477
H  1.158042 0.888642 1.210094
H  1.075142 1.643047 -0.396415
H  2.484045 -1.038693 0.238466
H  2.407434 -0.28885 -1.373791
H  3.706507 1.019801 1.108938
H  3.653767 1.723363 -0.52916
H  4.949218 -0.929303 -0.093793
H  6.05853 1.789795 -0.646563
H  6.572231 0.844739 0.777455
H  7.459872 -0.98007 -0.702842
H  6.917648 -0.100489 -2.168853
H  10.550727 0.357422 2.626224
