program: Gaussian 09
title: 000207942
version: EM64L-G09RevD.01
frameworkgroup: C1[X(C13H19N)]
method: RPBEPBE
basis: SDD
operation: Freq
keyword: #pfreq=noraman
keyword: PBEPBE/SDD
title: #p freq=noraman PBEPBE/SDD
converged: YES YES NO NO
title: Mulliken charges:
elementType: N C C C C C C C C C C C C C H H H H H H H H H H H H H H H H H H H
charge: -0.602019 0.187871 0.285812 -0.512359 -0.631609 0.357264 0.328733 -0.746189 -0.754268 -0.757495 -0.405894 -0.425806 -0.281366 -0.254598 0.201092 0.202299 0.218793 0.212325 0.220419 0.210758 0.213011 0.209428 0.194958 0.273585 0.211117 0.214300 0.208983 0.260420 0.257614 0.227890 0.229860 0.221919 0.223150
chargesum: 0.00000
title: Mulliken charges with hydrogens summed into heavy atoms:
elementType: N C C C C C C C C C C C C C
charge: -0.083985 0.187871 0.285812 -0.108968 -0.200491 0.357264 0.328733 -0.102001 -0.076296 -0.123095 -0.178003 -0.195946 -0.059447 -0.031448
polarizability: 1.69023234e+02 -3.17587687e+00 1.52204583e+02 5.94914227e+00 3.15101633e+00 1.01508324e+02
1716.lowfreq: -20.2014 -18.7549 -4.5255 -0.0009 -0.0007 -0.0007 53.8288 102.0900 146.7773
frequency: 53.6251 102.0654 146.7570 184.9725 226.4508 230.5827 240.3568 245.2253 260.1174 281.4502 292.8651 304.5343 328.5221 345.7229 370.7482 392.5986 446.1501 455.4541 488.3964 527.0045 531.8415 557.0112 619.0895 655.5531 696.6359 731.2061 765.4976 806.7609 808.7530 857.4726 866.4043 900.5452 906.4767 926.1370 936.8081 948.4115 962.7598 978.8912 981.4558 1011.4480 1039.8723 1054.3588 1067.9714 1084.0185 1100.4296 1135.0584 1150.6464 1174.1337 1186.3083 1207.8950 1224.0052 1256.2725 1277.1469 1303.3523 1321.5360 1338.8715 1345.4523 1363.9048 1374.9923 1378.6788 1389.9343 1434.9482 1443.1319 1451.4804 1463.0826 1465.7714 1468.5786 1473.1836 1480.1690 1484.3601 1497.7653 1587.5385 1611.7263 1631.9919 2955.4213 2956.6363 2962.3261 2966.9810 2971.9652 3004.3806 3015.2073 3057.5482 3058.5274 3058.7206 3064.6671 3077.0052 3098.1089 3104.9925 3117.2617 3133.9124 3155.5460 3416.3613 3544.3338
redmass: 3.1554 3.1945 2.7953 1.7284 1.7515 2.1018 1.0652 1.0649 2.2171 1.2231 2.6962 2.5243 2.6590 3.0365 2.4841 2.1131 2.7555 2.7821 2.4321 3.0761 3.1856 3.2806 3.6877 1.8149 4.3214 2.1880 1.5917 3.3624 3.4927 2.3452 1.4716 1.7857 1.9734 1.5216 1.8408 1.4797 1.6412 1.6576 1.3259 1.3257 2.4892 2.0061 1.9370 2.2981 1.6821 1.8067 1.3405 1.0766 2.4655 2.0766 2.2949 2.1546 1.9101 1.7622 1.6715 1.8451 1.6873 1.1936 2.5177 1.6877 1.2364 2.1998 1.1007 1.0956 1.0606 1.0754 1.0662 1.0792 1.0573 1.8797 1.1867 6.9899 6.2212 1.0970 1.0581 1.0430 1.0508 1.0366 1.0373 1.1000 1.1010 1.0986 1.0990 1.0992 1.0988 1.0995 1.0996 1.0871 1.0867 1.0928 1.1005 1.0443 1.0967
irintensity: 0.2175 0.1911 1.1401 6.0771 8.2755 4.5338 0.0304 8.7122 0.3563 11.3864 2.2712 0.8963 1.2639 1.9637 0.5868 0.9077 1.9055 16.3020 4.2322 1.1845 1.7225 3.9780 34.8426 138.3282 2.9838 22.2258 52.4616 3.5681 1.3582 6.0089 0.5995 0.3563 3.1909 2.9312 0.0470 1.0010 1.5650 4.6186 0.0278 0.4183 11.4573 8.0239 3.2267 16.5201 2.5826 10.9082 7.6349 0.2306 7.0887 1.5469 3.5471 16.2743 6.2333 10.1939 3.7781 7.6275 18.8303 18.4030 2.3918 13.2129 11.9348 7.3789 4.1072 3.6898 1.3777 1.6518 11.0878 10.8575 8.7423 12.7187 28.5607 2.5727 1.4213 47.7401 22.7806 7.0971 83.0612 26.2649 63.7507 18.5394 25.7139 20.0800 42.6481 34.5008 82.0131 37.6494 6.1947 15.3777 3.6651 38.0533 37.4088 3.6078 0.1201
temp: 298.150 k
press: 1.00000 atm
elementType: 7 6 6 6 6 6 6 6 6 6 6 6 6 6 1 1 1 1 1 1 1 1 1 1 1 1 1 1 1 1 1 1 1
symmnumber: 1
zpe: 755808.0 jmol-1
zpe.correction: 0.287872 hartree
zpe.thermalcorrener: 0.301725 hartree
zpe.thermalcorrenthalpy: 0.302669 hartree
zpe.thermalcorrgfe: 0.249266 hartree
zpe.sumelectzpe: -560.471696 hartree
zpe.sumelectthermal: -560.457843 hartree
zpe.sumelectthermalent: -560.456899 hartree
zpe.sumelectthermalfe: -560.510301 hartree
dipole: -1.9668 -0.5317 -0.0930
dipole: 2.0395
quadrupole: -79.7758 -80.4892 -88.5539
quadrupole: 1.3550 -1.5566 -0.5604
quadrupole: 3.1638 2.4504 -5.6142 1.3550 -1.5566 -0.5604
hfenergy: -560.7595678 hartree
pointgroup: C01 [X(C13H19N1)]
dipole: -0.7611602 0.2500238 0.0442268 debye
polarizability: 169.1768471|2.2868499|151.9354958|-6.5251969|3.2886747|101.6237985 unknown
InChI: InChI=1S/C13H19N/c1-12(2)9-13(3,14)8-10-6-4-5-7-11(10)12/h4-7H,8-9,14H2,1-3H3
charge 0 multiplicity 1
33 atoms
N  -1.999266 0.737974 -1.500517
C  -0.473857 -1.435936 0.117299
C  -1.99192 0.733581 -0.012678
C  -1.797981 -0.711721 0.516003
C  -0.794021 1.583697 0.472926
C  0.720686 -0.457822 0.068912
C  0.563532 0.950326 0.204925
C  -0.218963 -2.542982 1.186043
C  -0.626686 -2.120484 -1.276065
C  -3.312762 1.318003 0.569125
C  2.028179 -0.969881 -0.147101
C  1.702459 1.791779 0.123295
C  3.157282 -0.128839 -0.218694
C  2.995177 1.268871 -0.082185
H  -2.65387 -1.342187 0.197212
H  -1.849169 -0.653514 1.622382
H  -0.914366 1.747274 1.564016
H  -0.836412 2.589797 0.007815
H  -0.02017 -2.100731 2.179764
H  -1.106283 -3.199612 1.269203
H  0.642584 -3.180648 0.918691
H  0.291961 -2.670734 -1.55005
H  -1.46232 -2.847378 -1.254502
H  -0.827243 -1.358486 -2.046398
H  -3.45279 2.364424 0.235675
H  -4.182657 0.730506 0.217598
H  -3.3212 1.307957 1.675978
H  -1.974221 1.684954 -1.898172
H  -2.771682 0.189274 -1.898459
H  2.169587 -2.050979 -0.262896
H  1.566406 2.876879 0.221254
H  4.152091 -0.558006 -0.38391
H  3.860696 1.938444 -0.141089
