program: Gaussian 09
title: 000210335
version: EM64L-G09RevD.01
frameworkgroup: C1[X(C12H27NO4S2)]
method: RPBEPBE
basis: SDD
operation: Freq
keyword: #p
keyword: freq=noraman
keyword: PBEPBE/SDD
title: #p freq=noraman PBEPBE/SDD
converged: YES YES NO NO
title: Mulliken charges:
elementType: S S O O O O N C C C C C C C C C C C C H H H H H H H H H H H H H H H H H H H H H H H H H H H
charge: 0.094628 0.970671 -0.269659 -0.560334 -0.497780 -0.504140 -0.279969 -0.381605 -0.382612 -0.370232 -0.378662 -0.397928 -0.377441 -0.368541 -0.388773 -0.281500 -0.266429 -0.760734 -0.498573 0.195462 0.195918 0.193057 0.194212 0.191949 0.194164 0.195796 0.196329 0.190263 0.219487 0.189567 0.190124 0.218676 0.201285 0.212380 0.212529 0.273710 0.185144 0.185204 0.229861 0.219520 0.297156 0.309965 0.232733 0.198344 0.198350 0.378427
chargesum: 0.00000
title: Mulliken charges with hydrogens summed into heavy atoms:
elementType: S S O O O O N C C C C C C C C C C C C
charge: 0.094628 0.970671 -0.269659 -0.181907 -0.497780 -0.504140 -0.006259 0.009776 0.004657 0.015882 0.013464 0.011821 0.002250 0.051420 0.036136 0.088848 0.182952 -0.153613 0.130854
polarizability: 4.46041429e+02 2.57618998e+01 1.77844914e+02 -1.55715765e+00 3.94003247e-01 1.60538679e+02
1716.lowfreq: -7.3850 -2.6057 -0.0020 -0.0015 -0.0002 3.4493 6.9226 15.9281 20.3428
frequency: 5.6264 15.3798 20.2483 29.1068 37.4968 40.2351 51.2449 62.6305 69.8924 89.0426 97.4801 106.4001 107.6197 120.7454 123.3075 132.5282 142.6893 149.4986 154.3419 157.9630 179.4320 187.0170 207.4012 228.5503 235.8712 248.9434 271.0267 291.7389 305.3882 332.7168 374.8249 401.2012 413.3688 462.1687 484.7485 512.2194 523.6386 593.7062 699.6530 722.9644 730.5290 747.2973 748.3140 777.5174 822.2461 826.2707 882.0082 882.7396 929.5318 950.4667 972.3654 987.1964 999.3925 1012.4696 1026.1677 1036.0510 1051.7888 1057.8049 1060.1281 1069.4960 1080.3676 1081.7932 1087.2474 1107.7796 1111.7878 1121.1974 1154.4157 1157.6016 1158.1453 1181.1027 1202.0206 1212.4872 1231.6117 1244.5407 1257.1052 1267.6570 1274.9220 1281.5718 1283.7838 1286.4550 1289.9126 1294.9907 1296.5248 1314.3177 1335.0172 1350.7784 1359.3490 1361.2907 1380.2460 1384.6339 1421.7990 1438.5587 1452.2742 1457.8670 1461.5821 1462.1905 1466.0660 1467.5792 1468.3545 1472.7841 1477.8758 1482.4580 1486.6296 1490.6204 1493.5951 2876.4981 2899.8671 2917.6177 2920.2897 2946.3723 2951.4757 2952.6823 2953.7276 2954.3372 2957.6964 2962.6373 2967.4852 2985.7174 2989.3378 2991.3191 2992.0632 2996.8732 3001.7064 3018.6257 3025.1104 3034.5539 3046.7685 3054.7129 3057.6175 3099.3051 3453.1231 3462.1921
redmass: 6.4313 5.2901 5.3903 6.8297 1.9427 4.5821 3.3294 2.9162 2.1330 2.3648 2.9318 2.3404 3.1366 4.6164 2.4688 2.1377 2.6439 3.1590 2.0105 2.7423 2.3229 2.9826 3.8772 1.2112 5.0846 4.3164 5.3398 6.8297 6.1105 3.7173 4.0672 12.2487 3.5500 3.3277 3.2538 3.1428 14.5233 1.3035 4.3254 1.0620 1.0786 1.2090 1.1390 1.1401 1.2153 12.6742 2.5440 1.6705 9.3116 1.2237 2.3843 4.4597 2.7158 1.3377 2.4816 3.3619 2.9013 1.3905 2.8621 3.7137 2.1756 2.2274 3.0455 3.0764 1.2474 1.2505 1.4896 3.2026 1.5100 1.5655 1.4765 1.2976 1.3450 1.2660 1.2836 1.2430 1.0764 1.0954 1.1438 1.2063 1.1219 1.1115 1.1126 1.2943 1.3282 1.4381 1.6907 1.5821 1.4283 1.4035 1.0778 1.1602 1.2542 1.0514 1.0739 1.0759 1.0697 1.0639 1.0788 1.0830 1.0897 1.0894 1.0896 1.0891 1.0897 1.0701 1.0530 1.0691 1.0359 1.1056 1.0591 1.0588 1.0637 1.0595 1.0611 1.0616 1.0601 1.0965 1.1024 1.0593 1.0982 1.0856 1.1012 1.1036 1.0903 1.1041 1.1035 1.0979 1.1043 1.0967 1.0660 1.0752
irintensity: 0.2579 0.4301 0.1464 1.0845 3.2934 0.7267 1.8138 0.6720 0.8528 3.0609 5.4302 4.7705 15.4144 3.1598 8.6728 1.5158 1.4007 4.8245 0.5034 4.4374 51.0744 18.1197 49.0946 3.8599 11.9332 3.7029 27.6258 5.1517 13.0782 30.5025 10.3963 39.0904 19.8474 24.0165 20.8060 47.7819 172.0158 202.5872 1.2931 14.7289 0.0192 3.9562 12.2423 1.6069 7.1461 90.9353 12.5415 7.8915 75.3115 5.2435 2.9409 2.1125 3.1577 7.1575 0.6411 2.5943 38.1567 33.4570 6.0524 75.1348 0.1886 2.6286 39.7310 15.6231 0.1237 33.5125 3.2802 10.5500 4.1876 50.7520 20.9737 46.6131 12.9835 6.1095 3.0341 8.5716 4.0900 0.1497 0.6104 1.6770 14.6944 0.0406 2.2473 12.9753 10.2682 0.2394 0.0549 0.0439 87.7378 24.9289 14.2937 0.4973 36.8047 11.7783 0.1653 0.1127 4.2327 7.7497 1.4172 4.9387 0.6635 1.2756 5.0203 21.0682 16.2474 82.3123 50.6227 34.5981 109.4154 61.4993 0.1740 3.0918 4.1250 6.0645 1.3146 5.0544 175.4661 0.9051 77.6407 45.0000 0.7247 34.0964 0.5466 1.2081 21.9152 16.3147 136.0612 8.0855 132.7325 35.3380 74.1119 42.2007
temp: 298.150 k
press: 1.00000 atm
elementType: 16 16 8 8 8 8 7 6 6 6 6 6 6 6 6 6 6 6 6 1 1 1 1 1 1 1 1 1 1 1 1 1 1 1 1 1 1 1 1 1 1 1 1 1 1 1
symmnumber: 1
zpe: 1008334.9 jmol-1
zpe.correction: 0.384054 hartree
zpe.thermalcorrener: 0.410980 hartree
zpe.thermalcorrenthalpy: 0.411925 hartree
zpe.thermalcorrgfe: 0.319615 hartree
zpe.sumelectzpe: -1623.444120 hartree
zpe.sumelectthermal: -1623.417194 hartree
zpe.sumelectthermalent: -1623.416250 hartree
zpe.sumelectthermalfe: -1623.508560 hartree
dipole: 5.2801 0.7505 2.7898
dipole: 6.0188
quadrupole: -174.0441 -133.0398 -136.2677
quadrupole: 6.0232 4.1814 -5.0250
quadrupole: -26.2602 14.7441 11.5161 6.0232 4.1814 -5.0250
hfenergy: -1623.8281745 hartree
pointgroup: C01 [X(C12H27N1O4S2)]
dipole: -2.0795773 -1.1285436 0.0951301 debye
polarizability: 446.1871908|6.582436|162.7074514|24.1609373|5.7075069|175.5303803 unknown
InChI: InChI=1S/C12H26NOS.HO3S/c1-14-11-8-6-4-2-3-5-7-9-13-10-12-15;1-4(2)3/h13H,2-12H2,1H3;1H
charge 0 multiplicity 1
46 atoms
S  6.82507 -0.45646 -1.491506
S  7.986223 0.284162 0.578514
O  -9.727698 0.642131 0.215629
O  7.915593 -1.349016 1.473237
O  9.547683 0.68438 0.436722
O  6.98306 1.313868 1.337289
N  2.894671 0.132095 -0.368941
C  -2.162453 0.322422 -0.053896
C  -3.476884 -0.485412 0.033515
C  -0.901262 -0.570022 -0.079059
C  -4.739613 0.404688 0.0539
C  0.409654 0.238864 -0.199817
C  -6.05449 -0.404482 0.122211
C  1.659694 -0.661624 -0.236091
C  -7.311092 0.495239 0.140006
C  -8.611718 -0.310633 0.201624
C  4.162639 -0.584045 -0.54358
C  5.218856 0.402982 -1.077597
C  -11.024403 -0.025751 0.276581
H  -2.102649 1.020285 0.807279
H  -2.181767 0.954794 -0.965833
H  -3.534733 -1.183016 -0.828318
H  -3.459359 -1.118734 0.94519
H  -0.974135 -1.278566 -0.930528
H  -0.87278 -1.189998 0.841149
H  -4.751757 1.045311 -0.852367
H  -4.689516 1.094925 0.921603
H  0.485367 0.941974 0.656828
H  0.38947 0.857452 -1.118063
H  -6.102322 -1.094287 -0.746579
H  -6.041753 -1.045213 1.028897
H  1.600995 -1.345443 -1.106499
H  1.675513 -1.309367 0.675118
H  -7.333697 1.133196 -0.764695
H  -7.277388 1.17746 1.01144
H  2.949369 0.929198 0.27769
H  -8.639636 -0.943266 1.119289
H  -8.698506 -0.985661 -0.681531
H  4.549828 -1.063265 0.385447
H  4.000118 -1.394406 -1.279782
H  4.873062 0.921548 -1.990906
H  5.453135 1.173216 -0.31226
H  -11.785537 0.770526 0.282897
H  -11.126639 -0.638642 1.198676
H  -11.188635 -0.683482 -0.604768
H  8.644119 -1.335625 2.163583
