program: Gaussian 09
title: 000210312
version: EM64L-G09RevD.01
frameworkgroup: C1[X(C7H15NO3S2)]
method: RPBEPBE
basis: SDD
operation: Freq
keyword: #p
keyword: freq=noraman
keyword: PBEPBE/SDD
title: #p freq=noraman PBEPBE/SDD
converged: YES YES NO NO
title: Mulliken charges:
elementType: S S O O O N C C C C C C C H H H H H H H H H H H H H H H
charge: 0.097602 0.970283 -0.559627 -0.495088 -0.503071 -0.281549 -0.355424 -0.388428 -0.267310 -0.443215 -0.760312 -0.032313 -0.591106 0.200878 0.216130 0.219984 0.205970 0.219881 0.230288 0.273102 0.205697 0.197729 0.310405 0.297992 0.215929 0.217810 0.218772 0.378991
chargesum: 0.00000
title: Mulliken charges with hydrogens summed into heavy atoms:
elementType: S S O O O N C C C C C C C
charge: 0.097602 0.970283 -0.180636 -0.495088 -0.503071 -0.008447 0.061584 0.037526 0.182858 -0.039789 -0.151914 0.183616 -0.154524
polarizability: 3.49052229e+02 9.15829381e+00 1.34553835e+02 -2.23526856e+00 -1.41528039e+00 1.08303064e+02
1716.lowfreq: -6.4944 -2.4609 -0.0029 -0.0021 0.0016 4.7809 11.4554 25.7412 28.3634
frequency: 9.0505 25.6022 28.3536 44.3729 49.2611 79.4449 105.6015 113.0761 128.2963 131.2522 135.8992 176.5261 184.6001 204.4823 221.3485 254.1718 288.2494 292.3272 306.2619 389.8207 401.9813 423.1774 465.6793 523.1323 603.4133 640.1189 698.7838 748.5658 751.1083 827.4407 852.5394 922.0024 931.8647 945.9429 981.5564 996.5368 1010.3860 1017.2424 1045.5429 1055.2728 1063.9967 1084.6804 1122.1497 1156.7676 1170.3520 1202.7509 1241.5081 1258.4318 1273.9808 1279.8856 1289.0103 1294.6213 1318.7916 1343.1731 1378.9715 1423.8501 1428.0071 1454.2002 1461.6246 1469.7106 1481.1649 1489.4881 1659.8014 2873.5484 2918.0416 2953.2755 2955.5736 2978.5250 2997.4749 3019.5688 3025.1925 3050.6234 3055.7356 3075.5558 3091.6293 3195.3022 3455.2697 3461.7321
redmass: 5.3635 3.0847 4.4685 4.2542 3.7431 3.0106 2.6067 2.4345 3.1005 2.0266 5.3332 2.2908 2.6889 3.0957 9.4713 4.6329 5.8274 3.6692 6.2106 2.9272 12.6275 3.0015 2.5418 17.1641 1.2793 1.5456 4.6155 1.2248 1.1052 15.5355 1.2640 1.9990 9.4115 1.3289 1.7086 1.1895 1.4445 3.7201 2.5197 1.2942 2.4831 2.5654 1.2732 3.5096 1.6705 1.4789 1.2260 1.2461 1.2173 1.0995 1.1204 1.2080 1.2889 1.4138 1.4138 1.0766 1.1808 1.2481 1.0916 1.0810 1.0904 1.0822 4.7444 1.0700 1.0690 1.0640 1.0626 1.0624 1.0853 1.0962 1.0903 1.1024 1.0975 1.0770 1.0770 1.1144 1.0660 1.0750
irintensity: 0.4404 0.4369 0.9023 0.8911 1.2039 0.6621 8.0329 19.4598 5.1518 5.1779 5.4451 44.6961 29.3666 9.4836 44.2000 26.5436 6.1951 13.0625 17.1574 9.1908 42.5377 41.6012 24.5483 195.4600 233.8450 18.6935 1.6400 9.7379 8.7382 92.1224 1.3571 1.7035 74.2936 87.4755 8.5979 10.6004 20.7120 5.1483 15.3479 51.6914 3.3551 6.4377 26.5765 13.4108 20.4416 94.3714 3.2623 3.8100 14.9312 0.3899 14.8777 0.8139 21.6136 3.2934 83.3858 14.7497 4.1462 35.3079 3.3905 8.5078 0.9281 20.1557 23.7729 87.3969 34.5705 3.8757 21.2854 29.5519 32.6362 2.3230 22.3350 52.9213 8.3109 41.0243 8.9853 32.3708 73.0558 37.4970
temp: 298.150 k
press: 1.00000 atm
elementType: 16 16 8 8 8 7 6 6 6 6 6 6 6 1 1 1 1 1 1 1 1 1 1 1 1 1 1 1
symmnumber: 1
zpe: 571003.0 jmol-1
zpe.correction: 0.217484 hartree
zpe.thermalcorrener: 0.235687 hartree
zpe.thermalcorrenthalpy: 0.236631 hartree
zpe.thermalcorrgfe: 0.166495 hartree
zpe.sumelectzpe: -1351.009607 hartree
zpe.sumelectthermal: -1350.991404 hartree
zpe.sumelectthermalent: -1350.990460 hartree
zpe.sumelectthermalfe: -1351.060596 hartree
dipole: 4.4778 0.1535 1.3306
dipole: 4.6738
quadrupole: -108.7358 -92.9945 -96.2639
quadrupole: 3.1807 -7.6670 -5.0571
quadrupole: -9.4044 6.3369 3.0675 3.1807 -7.6670 -5.0571
hfenergy: -1351.2270911 hartree
pointgroup: C01 [X(C7H15N1O3S2)]
dipole: 1.7731853 0.4615549 0.1551198 debye
polarizability: 349.0060294|-4.0911038|111.5184771|-9.337136|-8.430826|131.3846211 unknown
InChI: InChI=1S/C7H14NS.HO3S/c1-2-3-4-5-8-6-7-9;1-4(2)3/h2,8H,1,3-7H2;1H
charge 0 multiplicity 1
28 atoms
S  -3.075647 0.853557 -1.436815
S  -4.280053 -0.192051 0.466588
O  -4.146183 1.257044 1.629599
O  -5.854016 -0.496364 0.253075
O  -3.325182 -1.379249 1.032765
N  0.815026 -0.044638 -0.372973
C  2.064748 0.678609 -0.076144
C  3.286963 -0.256469 -0.160419
C  -0.427442 0.733352 -0.446235
C  4.613701 0.484432 0.153739
C  -1.499398 -0.111644 -1.16034
C  5.826678 -0.408914 -0.004943
C  6.737069 -0.676337 0.964635
H  2.039018 1.16471 0.930563
H  2.169834 1.495958 -0.817609
H  3.330041 -0.697865 -1.174829
H  3.167199 -1.098321 0.551378
H  -0.222913 1.650897 -1.030363
H  -0.821546 1.060642 0.543756
H  0.720775 -0.932759 0.136065
H  4.582544 0.895534 1.181446
H  4.702717 1.350752 -0.536291
H  -1.770381 -0.99826 -0.548262
H  -1.152385 -0.470735 -2.1468
H  5.953604 -0.868452 -0.998523
H  7.594622 -1.333994 0.783075
H  6.650693 -0.243395 1.969349
H  -4.859587 1.142857 2.326413
