program: Gaussian 09
title: 000210316
version: EM64L-G09RevD.01
frameworkgroup: C1[X(C10H23NO3S2)]
method: RPBEPBE
basis: SDD
operation: Freq
keyword: #p
keyword: freq=noraman
keyword: PBEPBE/SDD
title: #p freq=noraman PBEPBE/SDD
converged: NO YES NO NO
title: Mulliken charges:
elementType: S S O O O N C C C C C C C C C C H H H H H H H H H H H H H H H H H H H H H H H
charge: 0.093238 0.971281 -0.560241 -0.498962 -0.505366 -0.291782 0.445973 -0.486825 -0.437389 -0.449689 -0.406247 -0.736328 -0.737384 -0.738135 -0.262389 -0.767580 0.214723 0.218803 0.204398 0.198996 0.217570 0.194326 0.214097 0.196946 0.282796 0.220819 0.226895 0.217428 0.226010 0.222021 0.223087 0.222492 0.215879 0.218963 0.228274 0.219415 0.310317 0.295349 0.378221
chargesum: 0.00000
title: Mulliken charges with hydrogens summed into heavy atoms:
elementType: S S O O O N C C C C C C C C C C
charge: 0.093238 0.971281 -0.182020 -0.498962 -0.505366 -0.008986 0.445973 -0.053299 -0.033994 -0.037793 0.004795 -0.071187 -0.066266 -0.080801 0.185300 -0.161914
polarizability: 3.99292840e+02 1.09417866e+01 1.72269806e+02 -5.14233181e+00 -1.05171782e+00 1.39455194e+02
1716.lowfreq: -10.0980 -0.0032 -0.0030 -0.0013 1.7587 12.0193 15.9304 23.3030 28.9505
frequency: 15.3074 20.4513 28.7625 36.6250 48.1855 61.6484 82.7124 98.7522 109.2617 127.4250 133.7543 142.4947 164.3377 180.5729 190.8459 208.1336 212.3697 222.2827 235.2601 258.0520 277.0824 286.7076 304.3627 311.7803 317.8167 327.6947 349.7724 390.0497 402.0290 436.5735 498.9283 522.6283 538.7874 602.0325 695.5090 701.8814 745.3912 748.3100 779.4714 783.1395 825.4435 852.8248 905.6181 927.9280 954.6008 968.3552 987.6261 1021.8721 1025.0103 1036.1675 1038.8146 1051.4894 1058.7083 1064.8007 1081.8600 1090.1047 1132.1902 1158.1107 1175.7729 1183.6889 1218.8260 1227.6755 1258.7740 1265.5258 1282.6156 1289.2504 1291.7786 1327.7064 1339.3006 1343.5277 1350.9385 1368.3349 1389.2402 1392.7357 1393.4157 1424.9850 1444.2029 1457.4837 1460.6320 1475.1651 1477.9745 1480.1587 1481.6251 1484.1434 1484.6424 1493.0721 1494.5430 1498.8821 2881.4154 2916.4317 2946.0493 2965.0163 2971.5506 2975.6489 2977.8451 2980.0864 2983.7991 3010.4259 3014.1477 3017.1678 3024.0765 3024.5031 3054.3195 3067.2145 3069.3755 3072.6750 3073.4976 3074.9155 3079.8368 3452.9627 3469.4008
redmass: 4.8179 5.2202 7.8928 4.7810 3.4473 2.3455 2.0162 2.5266 2.8434 1.8105 4.4825 2.4630 3.3233 1.8300 1.5384 2.1048 1.9519 1.8544 2.9743 3.7561 1.5410 5.8643 5.4810 2.3587 2.5737 2.0977 2.9339 3.3994 13.3093 4.4066 2.1406 16.1770 2.3124 1.2738 2.5978 4.2133 1.1734 1.2427 1.3834 1.2904 15.5666 1.7546 1.7784 9.0624 1.7305 1.7159 1.7860 1.6792 1.7183 1.6117 1.9205 2.9242 1.3241 2.7636 1.9540 1.9541 1.4496 3.0836 1.8964 1.9068 3.1094 1.2757 1.1573 1.2564 1.1894 1.1445 1.1764 1.2876 1.3943 1.5477 1.5108 1.3691 1.2178 1.2089 1.2061 1.0699 1.2206 1.0744 1.0734 1.0539 1.0550 1.0482 1.0600 1.0535 1.0623 1.0643 1.0655 1.0709 1.0705 1.0690 1.0646 1.0632 1.0575 1.0576 1.0377 1.0384 1.0381 1.0910 1.0963 1.0954 1.0899 1.0996 1.0969 1.0989 1.0983 1.0992 1.0989 1.0997 1.0996 1.0660 1.0746
irintensity: 0.3082 0.3094 0.3962 0.1200 1.3532 0.2255 0.4019 4.6131 17.1788 8.1552 10.6437 1.0483 3.1382 64.2359 11.5890 7.2750 33.0227 22.2758 5.1882 20.4306 3.9179 9.5932 12.9546 0.7589 4.7349 2.9455 39.0410 8.1731 44.4734 3.0124 2.3215 224.5197 0.3334 239.1013 0.2594 1.3311 4.9610 13.1803 41.3935 7.9738 93.4752 8.7336 11.0946 75.4541 7.5273 39.3691 6.7025 10.7618 3.2509 3.5652 5.6764 8.3660 51.0682 3.2236 6.1971 13.6467 20.8693 16.8496 67.0272 13.6108 15.3588 50.2603 1.5876 25.2732 19.8348 0.1734 24.7579 5.3442 7.0308 2.3416 4.0290 29.2951 19.6671 14.9884 21.9477 12.5281 26.5907 18.1277 1.6738 6.6159 11.5576 3.5406 5.9550 9.0116 13.7822 16.2761 38.5642 10.2577 65.8769 32.8694 5.2612 25.7210 32.8594 32.8131 42.4003 16.7171 39.3871 4.6436 18.3708 50.0472 27.9739 55.2424 7.2090 59.4988 56.2855 42.5994 59.3142 92.0471 41.4964 76.7902 54.2595
temp: 298.150 k
press: 1.00000 atm
elementType: 16 16 8 8 8 7 6 6 6 6 6 6 6 6 6 6 1 1 1 1 1 1 1 1 1 1 1 1 1 1 1 1 1 1 1 1 1 1 1
symmnumber: 1
zpe: 850172.2 jmol-1
zpe.correction: 0.323813 hartree
zpe.thermalcorrener: 0.346539 hartree
zpe.thermalcorrenthalpy: 0.347484 hartree
zpe.thermalcorrgfe: 0.268681 hartree
zpe.sumelectzpe: -1469.876336 hartree
zpe.sumelectthermal: -1469.853610 hartree
zpe.sumelectthermalent: -1469.852666 hartree
zpe.sumelectthermalfe: -1469.931468 hartree
dipole: -5.1092 0.3294 1.2805
dipole: 5.2775
quadrupole: -129.7343 -115.2085 -117.6458
quadrupole: 2.9587 8.0439 3.0539
quadrupole: -8.8715 5.6544 3.2171 2.9587 8.0439 3.0539
hfenergy: -1470.2001493 hartree
pointgroup: C01 [X(C10H23N1O3S2)]
dipole: 2.0331508 -0.0871557 0.4120956 debye
polarizability: 398.2090259|19.2652557|173.1031042|-4.7032619|2.7031755|139.7057097 unknown
InChI: InChI=1S/C10H22NS.HO3S/c1-4-10(5-2,6-3)9-11-7-8-12;1-4(2)3/h11H,4-9H2,1-3H3;1H
charge 0 multiplicity 1
39 atoms
S  -3.454997 1.536165 0.486389
S  -4.727604 -0.569847 0.084299
O  -4.704764 -1.192539 1.84105
O  -6.280329 -0.423653 -0.348331
O  -3.75982 -1.531382 -0.801026
N  0.402711 0.136371 0.020274
C  2.938913 -0.005689 -0.085789
C  1.652285 0.061348 0.796584
C  4.139329 -0.171806 0.900093
C  2.857164 -1.208945 -1.084911
C  3.064454 1.29506 -0.94589
C  5.540609 -0.237158 0.254948
C  2.641606 -2.609493 -0.468067
C  3.291768 2.61584 -0.178491
C  -0.828839 0.510493 0.723068
C  -1.8911 0.911769 -0.31993
H  1.649311 -0.812099 1.493185
H  1.699165 0.962639 1.437941
H  4.117428 0.669663 1.621815
H  3.980275 -1.087813 1.504446
H  3.789609 -1.222832 -1.682568
H  2.052315 -1.00336 -1.821667
H  2.13525 1.386407 -1.542447
H  3.890205 1.157055 -1.672651
H  0.276975 -0.634363 -0.64696
H  5.647492 -1.111146 -0.412753
H  5.762271 0.668921 -0.337383
H  6.318896 -0.322323 1.035496
H  3.470871 -2.893007 0.204841
H  2.586172 -3.374924 -1.263699
H  1.703224 -2.673722 0.114214
H  4.24399 2.613665 0.382621
H  2.476036 2.824478 0.538087
H  3.328064 3.464986 -0.885597
H  -1.246561 -0.293748 1.372122
H  -0.602801 1.370456 1.382017
H  -2.179617 0.032234 -0.93519
H  -1.524632 1.701565 -1.001338
H  -5.476721 -1.827263 1.934498
