program: Gaussian 09
title: 000210314
version: EM64L-G09RevD.01
frameworkgroup: C1[X(C9H21NO4S2)]
method: RPBEPBE
basis: SDD
operation: Freq
keyword: #p
keyword: freq=noraman
keyword: PBEPBE/SDD
title: #p freq=noraman PBEPBE/SDD
converged: YES YES NO NO
title: Mulliken charges:
elementType: S S O O O O N C C C C C C C C C H H H H H H H H H H H H H H H H H H H H H
charge: 0.096638 0.970521 -0.451985 -0.559831 -0.497125 -0.503731 -0.278145 -0.367612 -0.370759 -0.396182 -0.376416 -0.368071 -0.364602 -0.264533 -0.341089 -0.764522 0.192465 0.191637 0.197408 0.194969 0.189068 0.220538 0.190012 0.189675 0.200938 0.218927 0.214720 0.214246 0.272423 0.228831 0.220135 0.187268 0.187418 0.308436 0.298250 0.341486 0.378593
chargesum: 0.00000
title: Mulliken charges with hydrogens summed into heavy atoms:
elementType: S S O O O O N C C C C C C C C C
charge: 0.096638 0.970521 -0.110499 -0.181238 -0.497125 -0.503731 -0.005723 0.016490 0.021618 0.013423 0.003272 0.051794 0.064364 0.184433 0.033598 -0.157836
polarizability: 3.89740338e+02 2.63371923e+01 1.52469759e+02 -2.38734798e-01 9.93622140e-01 1.34969243e+02
1716.lowfreq: -17.0897 -5.0393 -0.0017 -0.0015 0.0017 3.1433 11.5017 17.4481 22.8317
frequency: -7.4623 16.2160 22.5292 32.0864 35.2501 46.9669 71.6302 82.6734 87.8712 107.6227 117.3024 128.3431 129.5520 140.3257 147.0172 166.9431 173.9442 185.0482 210.6992 241.8373 256.9613 275.8772 280.6865 305.0903 318.0198 367.8597 402.5686 433.7057 464.1613 509.1556 523.4361 605.3230 701.3212 727.7495 745.4517 746.9693 779.2286 826.9748 832.7872 910.0748 930.1110 959.8312 973.4774 988.7829 996.3757 1007.2763 1031.4876 1047.6124 1054.6488 1059.9177 1076.3552 1081.0245 1096.2328 1120.0390 1150.6433 1156.4370 1182.7561 1201.0900 1214.1513 1233.5665 1249.0980 1261.4550 1277.3696 1278.2390 1280.7089 1288.1550 1290.8783 1294.1086 1312.1417 1336.5754 1354.9380 1360.0054 1378.0335 1415.4578 1421.8265 1453.6939 1462.8359 1463.5293 1468.0899 1471.6851 1478.4449 1484.0213 1489.0931 1491.4074 2873.1753 2914.1347 2924.9262 2952.2823 2954.1593 2956.0685 2959.4632 2966.4944 2972.0393 2989.1440 2991.2645 2997.7896 3001.4953 3021.9141 3025.9096 3045.4491 3053.0834 3058.7931 3455.4396 3458.3189 3565.2860
redmass: 4.9252 4.0164 5.9014 3.7367 3.4204 3.2287 2.8720 2.4075 3.0386 2.9623 2.1782 2.4008 6.5862 2.2404 2.3871 5.1689 2.3573 2.7546 4.7636 4.5961 3.8224 1.0846 9.9447 6.4055 5.4543 3.5205 13.2761 4.4264 3.1224 3.4152 15.6685 1.2868 4.4309 1.0668 1.1351 1.1902 1.1247 13.6494 1.2028 1.2300 9.1418 6.8483 2.8523 1.5672 1.5280 4.3416 2.1013 3.3122 1.4000 2.3565 2.5081 2.1194 3.1703 1.2170 1.4092 3.3360 1.4641 1.2732 1.4064 1.2861 1.2890 1.2536 1.0521 1.2821 1.1263 1.1267 1.1049 1.1215 1.2910 1.3447 1.4991 1.6633 1.4336 1.4372 1.0792 1.2503 1.0734 1.0729 1.0705 1.0878 1.0909 1.0891 1.0847 1.0939 1.0699 1.0691 1.0545 1.0588 1.0592 1.0632 1.0625 1.0609 1.1064 1.0971 1.0591 1.0859 1.1002 1.0901 1.1032 1.1032 1.0982 1.1048 1.0662 1.0748 1.0664
irintensity: 1.2574 1.6700 0.1722 1.3255 2.2758 0.8633 2.4854 2.2962 3.0983 22.6328 5.4867 6.6112 10.5381 1.6476 2.6333 1.7909 27.9291 43.6496 56.5985 10.7520 11.0951 157.8755 21.1273 14.8461 1.8442 15.9365 44.2049 55.4402 40.9430 10.9657 186.9584 220.9244 1.2799 12.1882 3.5507 7.1889 4.2936 95.0909 2.2562 5.6181 73.8255 49.9569 18.1882 5.5746 35.8577 9.7090 8.6204 1.4581 49.3983 10.7910 3.8431 0.1979 0.3466 36.6112 1.2473 13.2673 65.7700 20.9315 33.9070 27.8560 3.6583 34.0302 2.2566 7.5126 2.1452 16.4253 0.7365 2.4934 5.2685 14.0612 1.7978 0.3545 82.2383 6.7093 15.3506 31.6504 0.2304 1.3373 2.1115 3.0733 2.0594 0.5593 11.6758 23.0086 81.6735 34.0877 62.2217 10.8405 2.4758 3.5096 1.8081 110.0064 52.8607 2.9090 45.3532 29.6095 2.9843 22.4293 5.1718 76.8530 6.9161 130.7417 80.9677 32.4666 2.1010
temp: 298.150 k
press: 1.00000 atm
elementType: 16 16 8 8 8 8 7 6 6 6 6 6 6 6 6 6 1 1 1 1 1 1 1 1 1 1 1 1 1 1 1 1 1 1 1 1 1
symmnumber: 1
zpe: 789041.9 jmol-1
zpe.correction: 0.300530 hartree
zpe.thermalcorrener: 0.322407 hartree
zpe.thermalcorrenthalpy: 0.323351 hartree
zpe.thermalcorrgfe: 0.245175 hartree
zpe.sumelectzpe: -1505.785704 hartree
zpe.sumelectthermal: -1505.763828 hartree
zpe.sumelectthermalent: -1505.762883 hartree
zpe.sumelectthermalfe: -1505.841059 hartree
dipole: 5.0473 0.2676 3.0368
dipole: 5.8965
quadrupole: -137.1682 -112.7292 -117.2911
quadrupole: 2.5802 8.9874 -4.8091
quadrupole: -14.7720 9.6670 5.1051 2.5802 8.9874 -4.8091
hfenergy: -1506.0862341 hartree
pointgroup: C01 [X(C9H21N1O4S2)]
dipole: 1.9906115 1.1868922 0.1024303 debye
polarizability: 390.127274|2.8486646|135.7065498|-24.3694135|-3.5811705|151.3455158 unknown
InChI: InChI=1S/C9H20NOS.HO3S/c11-8-5-3-1-2-4-6-10-7-9-12;1-4(2)3/h10-11H,1-9H2;1H
charge 0 multiplicity 1
37 atoms
S  -4.98573 0.362519 -1.560752
S  -6.082253 -0.208962 0.595853
O  8.960513 -0.610895 0.455318
O  -5.993084 1.493322 1.348673
O  -7.645292 -0.622151 0.533601
O  -5.052856 -1.171669 1.405561
N  -1.043654 -0.185794 -0.454585
C  2.73723 0.538782 -0.046744
C  4.001852 -0.34785 -0.006679
C  1.438126 -0.274517 -0.241929
C  5.303199 0.458041 0.206043
C  0.183404 0.617814 -0.305682
C  6.561674 -0.438093 0.234585
C  -2.311019 0.5268 -0.654127
C  7.850172 0.358408 0.454441
C  -3.374442 -0.479469 -1.130424
H  2.669794 1.123948 0.894081
H  2.836062 1.278725 -0.868361
H  4.077693 -0.922424 -0.952904
H  3.899904 -1.097615 0.805312
H  1.33344 -0.998261 0.594367
H  1.499209 -0.871864 -1.172201
H  5.401107 1.212907 -0.602467
H  5.227915 1.026567 1.156903
H  0.146641 1.269932 0.601982
H  0.252069 1.297623 -1.178346
H  6.651873 -0.995902 -0.717688
H  6.472487 -1.191732 1.041031
H  -1.107229 -0.968531 0.209146
H  -2.687233 1.05107 0.255226
H  -2.152076 1.300876 -1.42934
H  7.979665 1.106256 -0.359204
H  7.800876 0.903055 1.423383
H  -3.5984 -1.216584 -0.330426
H  -3.043291 -1.036804 -2.026475
H  9.816522 -0.132509 0.59368
H  -6.70077 1.535584 2.05925
